685 SPB


685SPB is registered to a Grey 1960, Morris Minor with a Petrol engine. It Failed its most recent MOT Test on the 12 January 2018

12 unique faults (12 Total) reported in its MOT History (8 Tests).

0 common/recurring faults.

75% (6) MOT Pass Rate and a 25% (2) MOT Failure Rate.

48,812 recorded miles.

685 SPB


685SPB is registered to a Grey 1960, Morris Minor with a Petrol engine. It Failed its most recent MOT Test on the 12 January 2018

12 unique faults (12 Total) reported in its MOT History (8 Tests).

0 common/recurring faults.

75% (6) MOT Pass Rate and a 25% (2) MOT Failure Rate.

48,812 recorded miles.

MOT PASS/Failure rate for 685 SPB

all MOT test results for 685 SPB represented as a percentage
MOT PASS/Failure rate for 685 SPB
all MOT test results for 685 SPB represented as a percentage

PERCENTAGE OF VEHICLE FAULTS WITH 685 SPB

ALL REPORTED FAULTS, DISPLAYED BY PERCENTAGE OF OCCURRENCE DURING ALL MOT TESTS
PERCENTAGE OF VEHICLE FAULTS WITH 685 SPB
ALL REPORTED FAULTS, DISPLAYED BY PERCENTAGE OF OCCURRENCE DURING ALL MOT TESTS
FAIL

685 SPB annual Faults by type

ALL REPORTED FAULTS, DISPLAYED over time and categorised by type
685 SPB annual Faults by type
ALL REPORTED FAULTS, DISPLAYED over time and categorised by type

ALL 685 SPB Failure Faults [12]

ALL Failure faults, ORDERED by OCCURRENCE DURING 685 SPB's MOT HISTORY
ALL 685 SPB Failure Faults [12]
ALL Failure faults, ORDERED by OCCURRENCE DURING 685 SPB's MOT HISTORY
Fail Faults | source www.vehiclestats.co.uk
Fault Fault Test Date Test Date/Time Reference MOT Test Reference
1 Nearside semaphore indicator arm arm does not show an amber light to the front (1.4.c.1b) Nearside semaphore indicator arm arm does not show an amber light to the front (1.4.c.1b) 03 January 2018 [16:47] 03/01/2018 964566079312 964566079312
1 Nearside semaphore indicator arm arm does not show an amber light to the rear (1.4.c.1b) Nearside semaphore indicator arm arm does not show an amber light to the rear (1.4.c.1b) 03 January 2018 [16:47] 03/01/2018 964566079312 964566079312
1 Windscreen washer provides insufficient washer liquid washers missing (8.2.3) Windscreen washer provides insufficient washer liquid washers missing (8.2.3) 03 January 2018 [16:47] 03/01/2018 964566079312 964566079312
1 Nearside front brake binding (3.7.b.1) Nearside front brake binding (3.7.b.1) 03 January 2018 [16:47] 03/01/2018 964566079312 964566079312
1 Nearside rear brake recording little or no effort (3.7.b.5a) Nearside rear brake recording little or no effort (3.7.b.5a) 03 January 2018 [16:47] 03/01/2018 964566079312 964566079312
1 Nearside rear parking brake recording little or no effort (3.7.b.6a) Nearside rear parking brake recording little or no effort (3.7.b.6a) 03 January 2018 [16:47] 03/01/2018 964566079312 964566079312
1 Rear brakes imbalanced across an axle axle 2 (3.7.b.5b) Rear brakes imbalanced across an axle axle 2 (3.7.b.5b) 03 January 2018 [16:47] 03/01/2018 964566079312 964566079312
1 Brakes imbalanced across an axle (3.7.b.5b) Brakes imbalanced across an axle (3.7.b.5b) 03 January 2018 [16:47] 03/01/2018 964566079312 964566079312
1 Nearside front position lamp(s) not working (1.1.a.3b) Nearside front position lamp(s) not working (1.1.a.3b) 21 December 2015 [11:39] 21/12/2015 718774758039 718774758039
1 Nearside headlamp not working on dipped beam (1.7.5a) Nearside headlamp not working on dipped beam (1.7.5a) 21 December 2015 [11:39] 21/12/2015 718774758039 718774758039
1 Fuel hose leaking carburetor feed pipe (7.2.3) Fuel hose leaking carburetor feed pipe (7.2.3) 21 December 2015 [11:39] 21/12/2015 718774758039 718774758039
1 Nearside steering rack gaiter split (2.2.d.2d) Nearside steering rack gaiter split (2.2.d.2d) 21 December 2015 [11:39] 21/12/2015 718774758039 718774758039

MOT TEST: 12 January 2018 15:53:28 PASSED
MOT TEST: 12 January 2018 15:53:28 PASSED

This test (540258012935) was completed on the 12 January 2018 15:53:28 and PASSED the requirements for a valid MOT with 0 comments.

This test (540258012935) was completed on the 12 January 2018 15:53:28 and PASSED the requirements for a valid MOT with 0 comments.

Recorded mileage: 48,812

Recorded mileage: 48,812


MOT TEST: 03 January 2018 16:47:54 FAILED
MOT TEST: 03 January 2018 16:47:54 FAILED

This test (964566079312) was completed on the 03 January 2018 16:47:54 and FAILED the requirements for a valid MOT with 8 comments.

This test (964566079312) was completed on the 03 January 2018 16:47:54 and FAILED the requirements for a valid MOT with 8 comments.

Recorded mileage: 48,812

Recorded mileage: 48,812


FAIL


MOT TEST: 20 December 2016 11:10:05 PASSED
MOT TEST: 20 December 2016 11:10:05 PASSED

This test (357136667187) was completed on the 20 December 2016 11:10:05 and PASSED the requirements for a valid MOT with 0 comments.

This test (357136667187) was completed on the 20 December 2016 11:10:05 and PASSED the requirements for a valid MOT with 0 comments.

Recorded mileage: 48,787

Recorded mileage: 48,787


MOT TEST: 22 December 2015 14:29:26 PASSED
MOT TEST: 22 December 2015 14:29:26 PASSED

This test (768986104566) was completed on the 22 December 2015 14:29:26 and PASSED the requirements for a valid MOT with 0 comments.

This test (768986104566) was completed on the 22 December 2015 14:29:26 and PASSED the requirements for a valid MOT with 0 comments.

Recorded mileage: 48,772

Recorded mileage: 48,772


MOT TEST: 21 December 2015 11:39:12 FAILED
MOT TEST: 21 December 2015 11:39:12 FAILED

This test (718774758039) was completed on the 21 December 2015 11:39:12 and FAILED the requirements for a valid MOT with 4 comments.

This test (718774758039) was completed on the 21 December 2015 11:39:12 and FAILED the requirements for a valid MOT with 4 comments.

Recorded mileage: 48,772

Recorded mileage: 48,772


FAIL


MOT TEST: 08 December 2014 15:34:12 PASSED
MOT TEST: 08 December 2014 15:34:12 PASSED

This test (838872344397) was completed on the 08 December 2014 15:34:12 and PASSED the requirements for a valid MOT with 0 comments.

This test (838872344397) was completed on the 08 December 2014 15:34:12 and PASSED the requirements for a valid MOT with 0 comments.

Recorded mileage: 48,712

Recorded mileage: 48,712


MOT TEST: 03 January 2014 12:47:33 PASSED
MOT TEST: 03 January 2014 12:47:33 PASSED

This test (166543604489) was completed on the 03 January 2014 12:47:33 and PASSED the requirements for a valid MOT with 0 comments.

This test (166543604489) was completed on the 03 January 2014 12:47:33 and PASSED the requirements for a valid MOT with 0 comments.

Recorded mileage: 48,679

Recorded mileage: 48,679


MOT TEST: 04 January 2013 10:08:03 PASSED
MOT TEST: 04 January 2013 10:08:03 PASSED

This test (558474403057) was completed on the 04 January 2013 10:08:03 and PASSED the requirements for a valid MOT with 0 comments.

This test (558474403057) was completed on the 04 January 2013 10:08:03 and PASSED the requirements for a valid MOT with 0 comments.

Recorded mileage: 48,608

Recorded mileage: 48,608