685 UXJ


685UXJ is registered to a Green 1957, Morris Minor with a Petrol engine. It Failed its most recent MOT Test on the 13 April 2015

23 unique faults (26 Total) reported in its MOT History (12 Tests).

3 common/recurring faults, the most frequent (2 times) is: this vehicle has had extensive chassis repairs and has been covered in underseal.

67% (8) MOT Pass Rate and a 33% (4) MOT Failure Rate.

57,278 recorded miles.

685 UXJ


685UXJ is registered to a Green 1957, Morris Minor with a Petrol engine. It Failed its most recent MOT Test on the 13 April 2015

23 unique faults (26 Total) reported in its MOT History (12 Tests).

3 common/recurring faults, the most frequent (2 times) is: this vehicle has had extensive chassis repairs and has been covered in underseal.

67% (8) MOT Pass Rate and a 33% (4) MOT Failure Rate.

57,278 recorded miles.

MOT PASS/Failure rate for 685 UXJ

all MOT test results for 685 UXJ represented as a percentage
MOT PASS/Failure rate for 685 UXJ
all MOT test results for 685 UXJ represented as a percentage

PERCENTAGE OF VEHICLE FAULTS WITH 685 UXJ

ALL REPORTED FAULTS, DISPLAYED BY PERCENTAGE OF OCCURRENCE DURING ALL MOT TESTS
PERCENTAGE OF VEHICLE FAULTS WITH 685 UXJ
ALL REPORTED FAULTS, DISPLAYED BY PERCENTAGE OF OCCURRENCE DURING ALL MOT TESTS
FAIL

USER ENTERED

PASS WITH RECTIFICATION

685 UXJ annual Faults by type

ALL REPORTED FAULTS, DISPLAYED over time and categorised by type
685 UXJ annual Faults by type
ALL REPORTED FAULTS, DISPLAYED over time and categorised by type

RECURRING FAULTS WITH 685 UXJ

FAULTS THAT HAVE OCCURED MORE THAN ONCE DURING 685 UXJ's MOT HISTORY
RECURRING FAULTS WITH 685 UXJ
FAULTS THAT HAVE OCCURED MORE THAN ONCE DURING 685 UXJ's MOT HISTORY
Fault Fault Test Date Test Date/Time Reference MOT Test Reference
2 This vehicle has had extensive chassis repairs and has been covered in underseal This vehicle has had extensive chassis repairs and has been covered in underseal 28 April 2010 [14:51] 28/04/2010 22 April 2010 [12:00] 22/04/2010 350938810144 350938810144 542432810191 542432810191
2 Windscreen washer provides insufficient washer liquid (8.2.3) Windscreen washer provides insufficient washer liquid (8.2.3) 22 April 2010 [12:00] 22/04/2010 19 April 2007 [11:47] 19/04/2007 542432810191 542432810191 241279207109 241279207109
2 Nearside stop lamp not working (1.2.1b) Nearside stop lamp not working (1.2.1b) 29 April 2008 [13:47] 29/04/2008 19 April 2007 [11:47] 19/04/2007 371660828113 371660828113 241279207109 241279207109

ALL 685 UXJ Failure Faults [18]

ALL Failure faults, ORDERED by OCCURRENCE DURING 685 UXJ's MOT HISTORY
ALL 685 UXJ Failure Faults [18]
ALL Failure faults, ORDERED by OCCURRENCE DURING 685 UXJ's MOT HISTORY
Fail Faults | source www.vehiclestats.co.uk
Fault Fault Test Date Test Date/Time Reference MOT Test Reference
2 Windscreen washer provides insufficient washer liquid (8.2.3) Windscreen washer provides insufficient washer liquid (8.2.3) 22 April 2010 [12:00] 22/04/2010 19 April 2007 [11:47] 19/04/2007 542432810191 542432810191 241279207109 241279207109
1 Direction indicators flashing less than 60 times a minute (1.4.a.2g) Direction indicators flashing less than 60 times a minute (1.4.a.2g) 23 April 2012 [10:11] 23/04/2012 665814812122 665814812122
1 Offside rear torsion bar attachment bracket corroded and seriously weakened (2.4.e.4c) Offside rear torsion bar attachment bracket corroded and seriously weakened (2.4.e.4c) 23 April 2012 [10:11] 23/04/2012 665814812122 665814812122
1 Offside rear suspension spring mounting prescribed area is inadequately repaired (2.4.a.3) Offside rear suspension spring mounting prescribed area is inadequately repaired (2.4.a.3) 23 April 2012 [10:11] 23/04/2012 665814812122 665814812122
1 Nearside front seat belt retracting mechanism defective (5.2.5b) Nearside front seat belt retracting mechanism defective (5.2.5b) 22 April 2010 [12:00] 22/04/2010 542432810191 542432810191
1 Offside front direction indicator not working (1.4.a.2c) Offside front direction indicator not working (1.4.a.2c) 22 April 2010 [12:00] 22/04/2010 542432810191 542432810191
1 Offside rear direction indicator not working (1.4.a.2c) Offside rear direction indicator not working (1.4.a.2c) 22 April 2010 [12:00] 22/04/2010 542432810191 542432810191
1 Service brake: efficiency below requirements (3.7.b.7) Service brake: efficiency below requirements (3.7.b.7) 22 April 2010 [12:00] 22/04/2010 542432810191 542432810191
1 Nearside front mechanical brake component has restricted free movement (3.5.1k) Nearside front mechanical brake component has restricted free movement (3.5.1k) 22 April 2010 [12:00] 22/04/2010 542432810191 542432810191
1 Offside rear mechanical brake component has restricted free movement (3.5.1k) Offside rear mechanical brake component has restricted free movement (3.5.1k) 22 April 2010 [12:00] 22/04/2010 542432810191 542432810191
1 Nearside front rear brake binding (3.7.b.1) Nearside front rear brake binding (3.7.b.1) 22 April 2010 [12:00] 22/04/2010 542432810191 542432810191
1 Offside rear rear brake binding (3.7.b.1) Offside rear rear brake binding (3.7.b.1) 22 April 2010 [12:00] 22/04/2010 542432810191 542432810191
1 Nearside rear rear brake recording little or no effort (3.7.b.5a) Nearside rear rear brake recording little or no effort (3.7.b.5a) 22 April 2010 [12:00] 22/04/2010 542432810191 542432810191
1 Nearside rear leaf spring has a deteriorated shackle pin rubber bush resulting in excessive movement (2.4.b.2) Nearside rear leaf spring has a deteriorated shackle pin rubber bush resulting in excessive movement (2.4.b.2) 22 April 2010 [12:00] 22/04/2010 542432810191 542432810191
1 Front exhaust has a major leak of exhaust gases (7.1.2) Front exhaust has a major leak of exhaust gases (7.1.2) 22 April 2010 [12:00] 22/04/2010 542432810191 542432810191
1 Nearside stop lamp not working (1.2.1b) Nearside stop lamp not working (1.2.1b) 19 April 2007 [11:47] 19/04/2007 241279207109 241279207109
1 Offside front tyre tread depth below requirements of 1.6mm (4.1.e.1) Offside front tyre tread depth below requirements of 1.6mm (4.1.e.1) 19 April 2007 [11:47] 19/04/2007 241279207109 241279207109

ALL 685 UXJ User Entered Faults [6]

ALL User Entered faults, ORDERED by OCCURRENCE DURING 685 UXJ's MOT HISTORY
ALL 685 UXJ User Entered Faults [6]
ALL User Entered faults, ORDERED by OCCURRENCE DURING 685 UXJ's MOT HISTORY
User Entered Faults | source www.vehiclestats.co.uk
Fault Fault Test Date Test Date/Time Reference MOT Test Reference
2 This vehicle has had extensive chassis repairs and has been covered in underseal This vehicle has had extensive chassis repairs and has been covered in underseal 28 April 2010 [14:51] 28/04/2010 22 April 2010 [12:00] 22/04/2010 350938810144 350938810144 542432810191 542432810191
1 This vehicle has had extensive chassis repairs This vehicle has had extensive chassis repairs 09 July 2012 [09:01] 09/07/2012 996151892156 996151892156
1 This vehicle has had extensive chassis repairs and is covered with thick underseal This vehicle has had extensive chassis repairs and is covered with thick underseal 23 April 2012 [10:11] 23/04/2012 665814812122 665814812122
1 Engine stabilizer bar broken Engine stabilizer bar broken 09 May 2006 [10:55] 09/05/2006 754779126132 754779126132
1 Boot not catching properly Boot not catching properly 09 May 2006 [10:55] 09/05/2006 754779126132 754779126132

ALL 685 UXJ Pass With Rectification Faults [2]

ALL Pass With Rectification faults, ORDERED by OCCURRENCE DURING 685 UXJ's MOT HISTORY
ALL 685 UXJ Pass With Rectification Faults [2]
ALL Pass With Rectification faults, ORDERED by OCCURRENCE DURING 685 UXJ's MOT HISTORY
Pass With Rectification Faults | source www.vehiclestats.co.uk
Fault Fault Test Date Test Date/Time Reference MOT Test Reference
1 Nearside stop lamp not working (1.2.1b) Nearside stop lamp not working (1.2.1b) 29 April 2008 [13:47] 29/04/2008 371660828113 371660828113
1 Nearside direction indicators flashing less than 60 times a minute (1.4.a.2g) Nearside direction indicators flashing less than 60 times a minute (1.4.a.2g) 29 April 2008 [13:47] 29/04/2008 371660828113 371660828113

MOT TEST: 13 April 2015 11:29:54 PASSED
MOT TEST: 13 April 2015 11:29:54 PASSED

This test (978813005177) was completed on the 13 April 2015 11:29:54 and PASSED the requirements for a valid MOT with 0 comments.

This test (978813005177) was completed on the 13 April 2015 11:29:54 and PASSED the requirements for a valid MOT with 0 comments.

Recorded mileage: 57,277

Recorded mileage: 57,277


MOT TEST: 09 July 2012 09:01:42 PASSED
MOT TEST: 09 July 2012 09:01:42 PASSED

This test (996151892156) was completed on the 09 July 2012 09:01:42 and PASSED the requirements for a valid MOT with 1 comments.

This test (996151892156) was completed on the 09 July 2012 09:01:42 and PASSED the requirements for a valid MOT with 1 comments.

Recorded mileage: 57,277

Recorded mileage: 57,277


USER ENTERED


MOT TEST: 23 April 2012 10:11:57 FAILED
MOT TEST: 23 April 2012 10:11:57 FAILED

This test (665814812122) was completed on the 23 April 2012 10:11:57 and FAILED the requirements for a valid MOT with 4 comments.

This test (665814812122) was completed on the 23 April 2012 10:11:57 and FAILED the requirements for a valid MOT with 4 comments.

Recorded mileage: 57,277

Recorded mileage: 57,277


FAIL

USER ENTERED


MOT TEST: 05 May 2011 10:04:49 PASSED
MOT TEST: 05 May 2011 10:04:49 PASSED

This test (508925821107) was completed on the 05 May 2011 10:04:49 and PASSED the requirements for a valid MOT with 0 comments.

This test (508925821107) was completed on the 05 May 2011 10:04:49 and PASSED the requirements for a valid MOT with 0 comments.

Recorded mileage: 57,277

Recorded mileage: 57,277


MOT TEST: 28 April 2010 14:51:47 PASSED
MOT TEST: 28 April 2010 14:51:47 PASSED

This test (350938810144) was completed on the 28 April 2010 14:51:47 and PASSED the requirements for a valid MOT with 1 comments.

This test (350938810144) was completed on the 28 April 2010 14:51:47 and PASSED the requirements for a valid MOT with 1 comments.

Recorded mileage: 57,277

Recorded mileage: 57,277


USER ENTERED


MOT TEST: 22 April 2010 12:00:46 FAILED
MOT TEST: 22 April 2010 12:00:46 FAILED

This test (542432810191) was completed on the 22 April 2010 12:00:46 and FAILED the requirements for a valid MOT with 13 comments.

This test (542432810191) was completed on the 22 April 2010 12:00:46 and FAILED the requirements for a valid MOT with 13 comments.

Recorded mileage: 57,277

Recorded mileage: 57,277


FAIL

USER ENTERED


MOT TEST: 22 May 2009 10:58:11 PASSED
MOT TEST: 22 May 2009 10:58:11 PASSED

This test (201322049474) was completed on the 22 May 2009 10:58:11 and PASSED the requirements for a valid MOT with 0 comments.

This test (201322049474) was completed on the 22 May 2009 10:58:11 and PASSED the requirements for a valid MOT with 0 comments.

Recorded mileage: 57,277

Recorded mileage: 57,277


MOT TEST: 29 April 2008 13:47:12 PASSED
MOT TEST: 29 April 2008 13:47:12 PASSED

This test (883480428120) was completed on the 29 April 2008 13:47:12 and PASSED the requirements for a valid MOT with 0 comments.

This test (883480428120) was completed on the 29 April 2008 13:47:12 and PASSED the requirements for a valid MOT with 0 comments.

Recorded mileage: 57,278

Recorded mileage: 57,278


MOT TEST: 29 April 2008 13:47:12 FAILED
MOT TEST: 29 April 2008 13:47:12 FAILED

This test (371660828113) was completed on the 29 April 2008 13:47:12 and FAILED the requirements for a valid MOT with 2 comments.

This test (371660828113) was completed on the 29 April 2008 13:47:12 and FAILED the requirements for a valid MOT with 2 comments.

Recorded mileage: 57,278

Recorded mileage: 57,278


PASS WITH RECTIFICATION


MOT TEST: 20 April 2007 11:07:53 PASSED
MOT TEST: 20 April 2007 11:07:53 PASSED

This test (701860217150) was completed on the 20 April 2007 11:07:53 and PASSED the requirements for a valid MOT with 0 comments.

This test (701860217150) was completed on the 20 April 2007 11:07:53 and PASSED the requirements for a valid MOT with 0 comments.

Recorded mileage: 57,278

Recorded mileage: 57,278


MOT TEST: 19 April 2007 11:47:21 FAILED
MOT TEST: 19 April 2007 11:47:21 FAILED

This test (241279207109) was completed on the 19 April 2007 11:47:21 and FAILED the requirements for a valid MOT with 3 comments.

This test (241279207109) was completed on the 19 April 2007 11:47:21 and FAILED the requirements for a valid MOT with 3 comments.

Recorded mileage: 57,277

Recorded mileage: 57,277


FAIL


MOT TEST: 09 May 2006 10:55:53 PASSED
MOT TEST: 09 May 2006 10:55:53 PASSED

This test (754779126132) was completed on the 09 May 2006 10:55:53 and PASSED the requirements for a valid MOT with 2 comments.

This test (754779126132) was completed on the 09 May 2006 10:55:53 and PASSED the requirements for a valid MOT with 2 comments.

Recorded mileage: 57,275

Recorded mileage: 57,275


USER ENTERED