688 UPA


688UPA is registered to a Grey 1961, Morris Minor with a Petrol engine. It Failed its most recent MOT Test on the 23 July 2014

21 unique faults (22 Total) reported in its MOT History (9 Tests).

1 common/recurring faults.

67% (6) MOT Pass Rate and a 33% (3) MOT Failure Rate.

43,552 recorded miles.

688 UPA


688UPA is registered to a Grey 1961, Morris Minor with a Petrol engine. It Failed its most recent MOT Test on the 23 July 2014

21 unique faults (22 Total) reported in its MOT History (9 Tests).

1 common/recurring faults.

67% (6) MOT Pass Rate and a 33% (3) MOT Failure Rate.

43,552 recorded miles.

MOT PASS/Failure rate for 688 UPA

all MOT test results for 688 UPA represented as a percentage
MOT PASS/Failure rate for 688 UPA
all MOT test results for 688 UPA represented as a percentage

PERCENTAGE OF VEHICLE FAULTS WITH 688 UPA

ALL REPORTED FAULTS, DISPLAYED BY PERCENTAGE OF OCCURRENCE DURING ALL MOT TESTS
PERCENTAGE OF VEHICLE FAULTS WITH 688 UPA
ALL REPORTED FAULTS, DISPLAYED BY PERCENTAGE OF OCCURRENCE DURING ALL MOT TESTS
ADVISORY

FAIL

688 UPA annual Faults by type

ALL REPORTED FAULTS, DISPLAYED over time and categorised by type
688 UPA annual Faults by type
ALL REPORTED FAULTS, DISPLAYED over time and categorised by type

ALL 688 UPA ADVISORIES [10]

ALL ADVISORIES, ORDERED by OCCURRENCE DURING 688 UPA's MOT HISTORY
ALL 688 UPA ADVISORIES [10]
ALL ADVISORIES, ORDERED by OCCURRENCE DURING 688 UPA's MOT HISTORY
Advisory Faults | source www.vehiclestats.co.uk
Fault Fault Test Date Test Date/Time Reference MOT Test Reference
1 Nearside front tie bar/rod has slight play in a pin/bush (2.4.g.2) Nearside front tie bar/rod has slight play in a pin/bush (2.4.g.2) 21 May 2012 [13:42] 21/05/2012 367372342186 367372342186
1 Offside front steering rack gaiter deteriorated (2.2.d.2d) Offside front steering rack gaiter deteriorated (2.2.d.2d) 21 May 2012 [13:42] 21/05/2012 367372342186 367372342186
1 Nearside front bonded suspension unit deteriorated but can function as intended (2.4.f.3) Nearside front bonded suspension unit deteriorated but can function as intended (2.4.f.3) 26 May 2011 [13:45] 26/05/2011 219796941457 219796941457
1 Offside front bonded suspension unit deteriorated but can function as intended (2.4.f.3) Offside front bonded suspension unit deteriorated but can function as intended (2.4.f.3) 26 May 2011 [13:45] 26/05/2011 219796941457 219796941457
1 Parking brake lever has little reserve travel (3.1.6b) Parking brake lever has little reserve travel (3.1.6b) 26 May 2011 [13:45] 26/05/2011 219796941457 219796941457
1 Nearside front shock absorber has a slightly reduced damping effect (2.7.5) Nearside front shock absorber has a slightly reduced damping effect (2.7.5) 26 May 2010 [13:55] 26/05/2010 613356340113 613356340113
1 Offside front shock absorber has a slightly reduced damping effect (2.7.5) Offside front shock absorber has a slightly reduced damping effect (2.7.5) 26 May 2010 [13:55] 26/05/2010 613356340113 613356340113
1 Nearside front front wheel bearing has slight play (2.5.a.3c) Nearside front front wheel bearing has slight play (2.5.a.3c) 26 May 2010 [13:55] 26/05/2010 613356340113 613356340113
1 Offside front front wheel bearing has slight play (2.5.a.3c) Offside front front wheel bearing has slight play (2.5.a.3c) 26 May 2010 [13:55] 26/05/2010 613356340113 613356340113
1 Brake rod worn but not seriously weakened (3.5.1e) Brake rod worn but not seriously weakened (3.5.1e) 26 May 2010 [13:55] 26/05/2010 613356340113 613356340113

ALL 688 UPA Failure Faults [12]

ALL Failure faults, ORDERED by OCCURRENCE DURING 688 UPA's MOT HISTORY
ALL 688 UPA Failure Faults [12]
ALL Failure faults, ORDERED by OCCURRENCE DURING 688 UPA's MOT HISTORY
Fail Faults | source www.vehiclestats.co.uk
Fault Fault Test Date Test Date/Time Reference MOT Test Reference
2 Brakes imbalanced across an axle (3.7.b.5b) Brakes imbalanced across an axle (3.7.b.5b) 22 July 2014 [14:41] 22/07/2014 29 May 2009 [13:01] 29/05/2009 905313604247 905313604247 553809949170 553809949170
1 Nearside registration plate lamp not working (1.1.c.1d) Nearside registration plate lamp not working (1.1.c.1d) 22 July 2014 [14:41] 22/07/2014 905313604247 905313604247
1 Parking brake: efficiency below requirements (3.7.b.7) Parking brake: efficiency below requirements (3.7.b.7) 22 July 2014 [14:41] 22/07/2014 905313604247 905313604247
1 Offside front tie bar/rod has excessive play in a pin/bush (2.4.g.2) Offside front tie bar/rod has excessive play in a pin/bush (2.4.g.2) 14 June 2013 [14:00] 14/06/2013 655185063164 655185063164
1 Nearside front upper suspension arm has excessive play in a pin/bush (2.4.g.2) Nearside front upper suspension arm has excessive play in a pin/bush (2.4.g.2) 14 June 2013 [14:00] 14/06/2013 655185063164 655185063164
1 Offside front suspension component mounting prescribed area is fractured (2.4.a.3) Offside front suspension component mounting prescribed area is fractured (2.4.a.3) 14 June 2013 [14:00] 14/06/2013 655185063164 655185063164
1 Offside rear suspension component mounting prescribed area is inadequately repaired (2.4.a.3) Offside rear suspension component mounting prescribed area is inadequately repaired (2.4.a.3) 14 June 2013 [14:00] 14/06/2013 655185063164 655185063164
1 Offside front mechanical brake component has restricted free movement (3.5.1k) Offside front mechanical brake component has restricted free movement (3.5.1k) 14 June 2013 [14:00] 14/06/2013 655185063164 655185063164
1 Service brake: efficiency below requirements (3.7.b.7) Service brake: efficiency below requirements (3.7.b.7) 14 June 2013 [14:00] 14/06/2013 655185063164 655185063164
1 Centre exhaust system not adequately supported (7.1.1) Centre exhaust system not adequately supported (7.1.1) 29 May 2009 [13:01] 29/05/2009 553809949170 553809949170
1 Offside rear suspension spring mounting prescribed area is inadequately repaired (2.4.a.3) Offside rear suspension spring mounting prescribed area is inadequately repaired (2.4.a.3) 29 May 2009 [13:01] 29/05/2009 553809949170 553809949170

MOT TEST: 23 July 2014 15:32:06 PASSED
MOT TEST: 23 July 2014 15:32:06 PASSED

This test (616864904255) was completed on the 23 July 2014 15:32:06 and PASSED the requirements for a valid MOT with 0 comments.

This test (616864904255) was completed on the 23 July 2014 15:32:06 and PASSED the requirements for a valid MOT with 0 comments.

Recorded mileage: 43,552

Recorded mileage: 43,552


MOT TEST: 22 July 2014 14:41:57 FAILED
MOT TEST: 22 July 2014 14:41:57 FAILED

This test (905313604247) was completed on the 22 July 2014 14:41:57 and FAILED the requirements for a valid MOT with 3 comments.

This test (905313604247) was completed on the 22 July 2014 14:41:57 and FAILED the requirements for a valid MOT with 3 comments.

Recorded mileage: 43,548

Recorded mileage: 43,548


FAIL


MOT TEST: 27 July 2013 11:31:18 PASSED
MOT TEST: 27 July 2013 11:31:18 PASSED

This test (305188903496) was completed on the 27 July 2013 11:31:18 and PASSED the requirements for a valid MOT with 0 comments.

This test (305188903496) was completed on the 27 July 2013 11:31:18 and PASSED the requirements for a valid MOT with 0 comments.

Recorded mileage: 42,785

Recorded mileage: 42,785


MOT TEST: 14 June 2013 14:00:46 FAILED
MOT TEST: 14 June 2013 14:00:46 FAILED

This test (655185063164) was completed on the 14 June 2013 14:00:46 and FAILED the requirements for a valid MOT with 6 comments.

This test (655185063164) was completed on the 14 June 2013 14:00:46 and FAILED the requirements for a valid MOT with 6 comments.

Recorded mileage: 42,761

Recorded mileage: 42,761


FAIL


MOT TEST: 21 May 2012 13:42:42 PASSED
MOT TEST: 21 May 2012 13:42:42 PASSED

This test (367372342186) was completed on the 21 May 2012 13:42:42 and PASSED the requirements for a valid MOT with 2 comments.

This test (367372342186) was completed on the 21 May 2012 13:42:42 and PASSED the requirements for a valid MOT with 2 comments.

Recorded mileage: 41,938

Recorded mileage: 41,938


ADVISORY


MOT TEST: 26 May 2011 13:45:35 PASSED
MOT TEST: 26 May 2011 13:45:35 PASSED

This test (219796941457) was completed on the 26 May 2011 13:45:35 and PASSED the requirements for a valid MOT with 3 comments.

This test (219796941457) was completed on the 26 May 2011 13:45:35 and PASSED the requirements for a valid MOT with 3 comments.

Recorded mileage: 41,229

Recorded mileage: 41,229


ADVISORY


MOT TEST: 26 May 2010 13:55:04 PASSED
MOT TEST: 26 May 2010 13:55:04 PASSED

This test (613356340113) was completed on the 26 May 2010 13:55:04 and PASSED the requirements for a valid MOT with 5 comments.

This test (613356340113) was completed on the 26 May 2010 13:55:04 and PASSED the requirements for a valid MOT with 5 comments.

Recorded mileage: 36,236

Recorded mileage: 36,236


ADVISORY


MOT TEST: 01 June 2009 16:07:29 PASSED
MOT TEST: 01 June 2009 16:07:29 PASSED

This test (400382359181) was completed on the 01 June 2009 16:07:29 and PASSED the requirements for a valid MOT with 0 comments.

This test (400382359181) was completed on the 01 June 2009 16:07:29 and PASSED the requirements for a valid MOT with 0 comments.

Recorded mileage: 36,722

Recorded mileage: 36,722


MOT TEST: 29 May 2009 13:01:23 FAILED
MOT TEST: 29 May 2009 13:01:23 FAILED

This test (553809949170) was completed on the 29 May 2009 13:01:23 and FAILED the requirements for a valid MOT with 3 comments.

This test (553809949170) was completed on the 29 May 2009 13:01:23 and FAILED the requirements for a valid MOT with 3 comments.

Recorded mileage: 36,697

Recorded mileage: 36,697


FAIL