689 HLK


689HLK is registered to a Green 1964, Morris Minor traveller with a Petrol engine. It Failed its most recent MOT Test on the 13 July 2017

7 unique faults (8 Total) reported in its MOT History (5 Tests).

1 common/recurring faults.

60% (3) MOT Pass Rate and a 40% (2) MOT Failure Rate.

92,737 recorded miles.

689 HLK


689HLK is registered to a Green 1964, Morris Minor traveller with a Petrol engine. It Failed its most recent MOT Test on the 13 July 2017

7 unique faults (8 Total) reported in its MOT History (5 Tests).

1 common/recurring faults.

60% (3) MOT Pass Rate and a 40% (2) MOT Failure Rate.

92,737 recorded miles.

MOT PASS/Failure rate for 689 HLK

all MOT test results for 689 HLK represented as a percentage
MOT PASS/Failure rate for 689 HLK
all MOT test results for 689 HLK represented as a percentage

PERCENTAGE OF VEHICLE FAULTS WITH 689 HLK

ALL REPORTED FAULTS, DISPLAYED BY PERCENTAGE OF OCCURRENCE DURING ALL MOT TESTS
PERCENTAGE OF VEHICLE FAULTS WITH 689 HLK
ALL REPORTED FAULTS, DISPLAYED BY PERCENTAGE OF OCCURRENCE DURING ALL MOT TESTS
ADVISORY

FAIL

USER ENTERED

689 HLK annual Faults by type

ALL REPORTED FAULTS, DISPLAYED over time and categorised by type
689 HLK annual Faults by type
ALL REPORTED FAULTS, DISPLAYED over time and categorised by type

ALL 689 HLK ADVISORIES [1]

ALL ADVISORIES, ORDERED by OCCURRENCE DURING 689 HLK's MOT HISTORY
ALL 689 HLK ADVISORIES [1]
ALL ADVISORIES, ORDERED by OCCURRENCE DURING 689 HLK's MOT HISTORY
Advisory Faults | source www.vehiclestats.co.uk
Fault Fault Test Date Test Date/Time Reference MOT Test Reference
1 Brake pipe slightly corroded (3.6.b.2c) Brake pipe slightly corroded (3.6.b.2c) 23 August 2007 [17:29] 23/08/2007 630605237202 630605237202

ALL 689 HLK Failure Faults [5]

ALL Failure faults, ORDERED by OCCURRENCE DURING 689 HLK's MOT HISTORY
ALL 689 HLK Failure Faults [5]
ALL Failure faults, ORDERED by OCCURRENCE DURING 689 HLK's MOT HISTORY
Fail Faults | source www.vehiclestats.co.uk
Fault Fault Test Date Test Date/Time Reference MOT Test Reference
1 Offside rear position lamp(s) not working (1.1.a.3b) Offside rear position lamp(s) not working (1.1.a.3b) 10 July 2017 [15:46] 10/07/2017 353423240077 353423240077
1 Offside registration plate lamp not working (1.1.c.1d) Offside registration plate lamp not working (1.1.c.1d) 10 July 2017 [15:46] 10/07/2017 353423240077 353423240077
1 Windscreen washer provides insufficient washer liquid (8.2.3) Windscreen washer provides insufficient washer liquid (8.2.3) 10 July 2017 [15:46] 10/07/2017 353423240077 353423240077
1 Offside front hydraulic brake cylinder leaking hydraulic fluid (3.6.a.1) Offside front hydraulic brake cylinder leaking hydraulic fluid (3.6.a.1) 10 July 2017 [15:46] 10/07/2017 353423240077 353423240077
1 Nearside front hydraulic brake cylinder leaking hydraulic fluid (3.6.a.1) Nearside front hydraulic brake cylinder leaking hydraulic fluid (3.6.a.1) 18 May 2011 [12:34] 18/05/2011 846258131189 846258131189

ALL 689 HLK User Entered Faults [2]

ALL User Entered faults, ORDERED by OCCURRENCE DURING 689 HLK's MOT HISTORY
ALL 689 HLK User Entered Faults [2]
ALL User Entered faults, ORDERED by OCCURRENCE DURING 689 HLK's MOT HISTORY
User Entered Faults | source www.vehiclestats.co.uk
Fault Fault Test Date Test Date/Time Reference MOT Test Reference
2 Crack in o/s floor Crack in o/s floor 19 May 2011 [09:07] 19/05/2011 18 May 2011 [12:34] 18/05/2011 677359731130 677359731130 846258131189 846258131189

MOT TEST: 13 July 2017 11:47:40 PASSED
MOT TEST: 13 July 2017 11:47:40 PASSED

This test (881416477820) was completed on the 13 July 2017 11:47:40 and PASSED the requirements for a valid MOT with 0 comments.

This test (881416477820) was completed on the 13 July 2017 11:47:40 and PASSED the requirements for a valid MOT with 0 comments.

Recorded mileage: 92,737

Recorded mileage: 92,737


MOT TEST: 10 July 2017 15:46:16 FAILED
MOT TEST: 10 July 2017 15:46:16 FAILED

This test (353423240077) was completed on the 10 July 2017 15:46:16 and FAILED the requirements for a valid MOT with 4 comments.

This test (353423240077) was completed on the 10 July 2017 15:46:16 and FAILED the requirements for a valid MOT with 4 comments.

Recorded mileage: 92,735

Recorded mileage: 92,735


FAIL


MOT TEST: 19 May 2011 09:07:01 PASSED
MOT TEST: 19 May 2011 09:07:01 PASSED

This test (677359731130) was completed on the 19 May 2011 09:07:01 and PASSED the requirements for a valid MOT with 1 comments.

This test (677359731130) was completed on the 19 May 2011 09:07:01 and PASSED the requirements for a valid MOT with 1 comments.

Recorded mileage: 92,688

Recorded mileage: 92,688


USER ENTERED


MOT TEST: 18 May 2011 12:34:20 FAILED
MOT TEST: 18 May 2011 12:34:20 FAILED

This test (846258131189) was completed on the 18 May 2011 12:34:20 and FAILED the requirements for a valid MOT with 2 comments.

This test (846258131189) was completed on the 18 May 2011 12:34:20 and FAILED the requirements for a valid MOT with 2 comments.

Recorded mileage: 92,687

Recorded mileage: 92,687


FAIL

USER ENTERED


MOT TEST: 23 August 2007 17:29:07 PASSED
MOT TEST: 23 August 2007 17:29:07 PASSED

This test (630605237202) was completed on the 23 August 2007 17:29:07 and PASSED the requirements for a valid MOT with 1 comments.

This test (630605237202) was completed on the 23 August 2007 17:29:07 and PASSED the requirements for a valid MOT with 1 comments.

Recorded mileage: 92,683

Recorded mileage: 92,683


ADVISORY