689 UXY


689UXY is registered to a Green 1964, Morris Minor 1000 with a Petrol engine. It Failed its most recent MOT Test on the 02 May 2013

20 unique faults (22 Total) reported in its MOT History (12 Tests).

1 common/recurring faults.

67% (8) MOT Pass Rate and a 33% (4) MOT Failure Rate.

61,212 recorded miles.

689 UXY


689UXY is registered to a Green 1964, Morris Minor 1000 with a Petrol engine. It Failed its most recent MOT Test on the 02 May 2013

20 unique faults (22 Total) reported in its MOT History (12 Tests).

1 common/recurring faults.

67% (8) MOT Pass Rate and a 33% (4) MOT Failure Rate.

61,212 recorded miles.

MOT PASS/Failure rate for 689 UXY

all MOT test results for 689 UXY represented as a percentage
MOT PASS/Failure rate for 689 UXY
all MOT test results for 689 UXY represented as a percentage

PERCENTAGE OF VEHICLE FAULTS WITH 689 UXY

ALL REPORTED FAULTS, DISPLAYED BY PERCENTAGE OF OCCURRENCE DURING ALL MOT TESTS
PERCENTAGE OF VEHICLE FAULTS WITH 689 UXY
ALL REPORTED FAULTS, DISPLAYED BY PERCENTAGE OF OCCURRENCE DURING ALL MOT TESTS
ADVISORY

FAIL

USER ENTERED

689 UXY annual Faults by type

ALL REPORTED FAULTS, DISPLAYED over time and categorised by type
689 UXY annual Faults by type
ALL REPORTED FAULTS, DISPLAYED over time and categorised by type

ALL 689 UXY ADVISORIES [4]

ALL ADVISORIES, ORDERED by OCCURRENCE DURING 689 UXY's MOT HISTORY
ALL 689 UXY ADVISORIES [4]
ALL ADVISORIES, ORDERED by OCCURRENCE DURING 689 UXY's MOT HISTORY
Advisory Faults | source www.vehiclestats.co.uk
Fault Fault Test Date Test Date/Time Reference MOT Test Reference
3 Brakes imbalanced requirements only just met. It would appear that the braking system requires adjustment or repair. (3.7.b.5b) Brakes imbalanced requirements only just met. It would appear that the braking system requires adjustment or repair. (3.7.b.5b) 03 October 2011 [10:14] 03/10/2011 12 October 2010 [12:21] 12/10/2010 22 May 2009 [12:16] 22/05/2009 457236271238 457236271238 194855680288 194855680288 200622049429 200622049429
1 Offside front brake grabbing slightly (3.7.a.2b) Offside front brake grabbing slightly (3.7.a.2b) 03 October 2011 [10:14] 03/10/2011 457236271238 457236271238

ALL 689 UXY Failure Faults [15]

ALL Failure faults, ORDERED by OCCURRENCE DURING 689 UXY's MOT HISTORY
ALL 689 UXY Failure Faults [15]
ALL Failure faults, ORDERED by OCCURRENCE DURING 689 UXY's MOT HISTORY
Fail Faults | source www.vehiclestats.co.uk
Fault Fault Test Date Test Date/Time Reference MOT Test Reference
1 Headlamp aim too low (1.8) Headlamp aim too low (1.8) 02 May 2013 [14:21] 02/05/2013 246912623111 246912623111
1 Windscreen wiper not operating automatically when switched on (8.2.1b) Windscreen wiper not operating automatically when switched on (8.2.1b) 02 May 2013 [14:21] 02/05/2013 246912623111 246912623111
1 Windscreen washer provides insufficient washer liquid (8.2.3) Windscreen washer provides insufficient washer liquid (8.2.3) 02 May 2013 [14:21] 02/05/2013 246912623111 246912623111
1 Nearside rear rear brake binding (3.7.b.1) Nearside rear rear brake binding (3.7.b.1) 02 May 2013 [14:21] 02/05/2013 246912623111 246912623111
1 Offside rear rear brake binding (3.7.b.1) Offside rear rear brake binding (3.7.b.1) 02 May 2013 [14:21] 02/05/2013 246912623111 246912623111
1 Steering component mounting prescribed area is excessively corroded (2.2.c.1h) Steering component mounting prescribed area is excessively corroded (2.2.c.1h) 02 May 2013 [14:21] 02/05/2013 246912623111 246912623111
1 Parking brake: efficiency below requirements (3.7.b.7) Parking brake: efficiency below requirements (3.7.b.7) 02 May 2013 [14:21] 02/05/2013 246912623111 246912623111
1 Nearside front suspension spring mounting prescribed area is excessively corroded (2.4.a.3) Nearside front suspension spring mounting prescribed area is excessively corroded (2.4.a.3) 02 October 2012 [21:40] 02/10/2012 116906672291 116906672291
1 Nearside rear suspension spring mounting prescribed area is excessively corroded (2.4.a.3) Nearside rear suspension spring mounting prescribed area is excessively corroded (2.4.a.3) 02 October 2012 [21:40] 02/10/2012 116906672291 116906672291
1 Centre upper steering rack damaged and unserviceable (2.2.c.1d) Centre upper steering rack damaged and unserviceable (2.2.c.1d) 25 July 2007 [15:10] 25/07/2007 853436207215 853436207215
1 Offside front brake hose excessively deteriorated (3.6.b.4d) Offside front brake hose excessively deteriorated (3.6.b.4d) 25 July 2007 [15:10] 25/07/2007 853436207215 853436207215
1 Nearside rear shock absorber has negligible damping effect (2.7.5) Nearside rear shock absorber has negligible damping effect (2.7.5) 20 March 2006 [11:35] 20/03/2006 284449676042 284449676042
1 Offside rear shock absorber has negligible damping effect (2.7.5) Offside rear shock absorber has negligible damping effect (2.7.5) 20 March 2006 [11:35] 20/03/2006 284449676042 284449676042
1 Nearside windscreen washer provides insufficient washer liquid (8.2.3) Nearside windscreen washer provides insufficient washer liquid (8.2.3) 20 March 2006 [11:35] 20/03/2006 284449676042 284449676042
1 Brakes imbalanced across an axle (3.7.b.5b) Brakes imbalanced across an axle (3.7.b.5b) 20 March 2006 [11:35] 20/03/2006 284449676042 284449676042

ALL 689 UXY User Entered Faults [3]

ALL User Entered faults, ORDERED by OCCURRENCE DURING 689 UXY's MOT HISTORY
ALL 689 UXY User Entered Faults [3]
ALL User Entered faults, ORDERED by OCCURRENCE DURING 689 UXY's MOT HISTORY
User Entered Faults | source www.vehiclestats.co.uk
Fault Fault Test Date Test Date/Time Reference MOT Test Reference
1 Nearside rear brake binding slightly but not excessive Nearside rear brake binding slightly but not excessive 27 March 2013 [14:39] 27/03/2013 757886683035 757886683035
1 Slight free play in offside front suspension lower swivel Slight free play in offside front suspension lower swivel 12 October 2010 [12:21] 12/10/2010 194855680288 194855680288
1 Rear bump stops missing Rear bump stops missing 20 March 2006 [11:35] 20/03/2006 284449676042 284449676042

MOT TEST: 02 May 2013 14:21:37 FAILED
MOT TEST: 02 May 2013 14:21:37 FAILED

This test (246912623111) was completed on the 02 May 2013 14:21:37 and FAILED the requirements for a valid MOT with 7 comments.

This test (246912623111) was completed on the 02 May 2013 14:21:37 and FAILED the requirements for a valid MOT with 7 comments.

Recorded mileage: 61,212

Recorded mileage: 61,212


FAIL


MOT TEST: 27 March 2013 14:39:07 PASSED
MOT TEST: 27 March 2013 14:39:07 PASSED

This test (757886683035) was completed on the 27 March 2013 14:39:07 and PASSED the requirements for a valid MOT with 1 comments.

This test (757886683035) was completed on the 27 March 2013 14:39:07 and PASSED the requirements for a valid MOT with 1 comments.

Recorded mileage: 61,212

Recorded mileage: 61,212


USER ENTERED


MOT TEST: 05 October 2012 14:25:11 PASSED
MOT TEST: 05 October 2012 14:25:11 PASSED

This test (946099872239) was completed on the 05 October 2012 14:25:11 and PASSED the requirements for a valid MOT with 0 comments.

This test (946099872239) was completed on the 05 October 2012 14:25:11 and PASSED the requirements for a valid MOT with 0 comments.

Recorded mileage: 61,212

Recorded mileage: 61,212


MOT TEST: 02 October 2012 21:40:08 FAILED
MOT TEST: 02 October 2012 21:40:08 FAILED

This test (116906672291) was completed on the 02 October 2012 21:40:08 and FAILED the requirements for a valid MOT with 2 comments.

This test (116906672291) was completed on the 02 October 2012 21:40:08 and FAILED the requirements for a valid MOT with 2 comments.

Recorded mileage: 61,212

Recorded mileage: 61,212


FAIL


MOT TEST: 03 October 2011 10:14:29 PASSED
MOT TEST: 03 October 2011 10:14:29 PASSED

This test (457236271238) was completed on the 03 October 2011 10:14:29 and PASSED the requirements for a valid MOT with 2 comments.

This test (457236271238) was completed on the 03 October 2011 10:14:29 and PASSED the requirements for a valid MOT with 2 comments.

Recorded mileage: 61,212

Recorded mileage: 61,212


ADVISORY


MOT TEST: 12 October 2010 12:21:02 PASSED
MOT TEST: 12 October 2010 12:21:02 PASSED

This test (194855680288) was completed on the 12 October 2010 12:21:02 and PASSED the requirements for a valid MOT with 2 comments.

This test (194855680288) was completed on the 12 October 2010 12:21:02 and PASSED the requirements for a valid MOT with 2 comments.

Recorded mileage: 61,212

Recorded mileage: 61,212


ADVISORY

USER ENTERED


MOT TEST: 22 May 2009 12:16:03 PASSED
MOT TEST: 22 May 2009 12:16:03 PASSED

This test (200622049429) was completed on the 22 May 2009 12:16:03 and PASSED the requirements for a valid MOT with 1 comments.

This test (200622049429) was completed on the 22 May 2009 12:16:03 and PASSED the requirements for a valid MOT with 1 comments.

Recorded mileage: 61,212

Recorded mileage: 61,212


ADVISORY


MOT TEST: 31 July 2007 11:23:54 PASSED
MOT TEST: 31 July 2007 11:23:54 PASSED

This test (153822417227) was completed on the 31 July 2007 11:23:54 and PASSED the requirements for a valid MOT with 0 comments.

This test (153822417227) was completed on the 31 July 2007 11:23:54 and PASSED the requirements for a valid MOT with 0 comments.

Recorded mileage: 59,525

Recorded mileage: 59,525


MOT TEST: 25 July 2007 15:10:41 FAILED
MOT TEST: 25 July 2007 15:10:41 FAILED

This test (853436207215) was completed on the 25 July 2007 15:10:41 and FAILED the requirements for a valid MOT with 2 comments.

This test (853436207215) was completed on the 25 July 2007 15:10:41 and FAILED the requirements for a valid MOT with 2 comments.

Recorded mileage: 59,525

Recorded mileage: 59,525


FAIL


MOT TEST: 11 December 2006 17:04:06 PASSED
MOT TEST: 11 December 2006 17:04:06 PASSED

This test (583925346306) was completed on the 11 December 2006 17:04:06 and PASSED the requirements for a valid MOT with 0 comments.

This test (583925346306) was completed on the 11 December 2006 17:04:06 and PASSED the requirements for a valid MOT with 0 comments.

Recorded mileage: 59,353

Recorded mileage: 59,353


MOT TEST: 22 March 2006 16:04:06 PASSED
MOT TEST: 22 March 2006 16:04:06 PASSED

This test (113851386077) was completed on the 22 March 2006 16:04:06 and PASSED the requirements for a valid MOT with 0 comments.

This test (113851386077) was completed on the 22 March 2006 16:04:06 and PASSED the requirements for a valid MOT with 0 comments.

Recorded mileage: 58,511

Recorded mileage: 58,511


MOT TEST: 20 March 2006 11:35:14 FAILED
MOT TEST: 20 March 2006 11:35:14 FAILED

This test (284449676042) was completed on the 20 March 2006 11:35:14 and FAILED the requirements for a valid MOT with 5 comments.

This test (284449676042) was completed on the 20 March 2006 11:35:14 and FAILED the requirements for a valid MOT with 5 comments.

Recorded mileage: 58,511

Recorded mileage: 58,511


FAIL

USER ENTERED