696 UXW


696UXW is registered to a Blue 1959, Morris Minor 1000 with a Petrol engine. It Failed its most recent MOT Test on the 04 April 2013

19 unique faults (19 Total) reported in its MOT History (10 Tests).

0 common/recurring faults.

80% (8) MOT Pass Rate and a 20% (2) MOT Failure Rate.

39,021 recorded miles.

696 UXW


696UXW is registered to a Blue 1959, Morris Minor 1000 with a Petrol engine. It Failed its most recent MOT Test on the 04 April 2013

19 unique faults (19 Total) reported in its MOT History (10 Tests).

0 common/recurring faults.

80% (8) MOT Pass Rate and a 20% (2) MOT Failure Rate.

39,021 recorded miles.

MOT PASS/Failure rate for 696 UXW

all MOT test results for 696 UXW represented as a percentage
MOT PASS/Failure rate for 696 UXW
all MOT test results for 696 UXW represented as a percentage

PERCENTAGE OF VEHICLE FAULTS WITH 696 UXW

ALL REPORTED FAULTS, DISPLAYED BY PERCENTAGE OF OCCURRENCE DURING ALL MOT TESTS
PERCENTAGE OF VEHICLE FAULTS WITH 696 UXW
ALL REPORTED FAULTS, DISPLAYED BY PERCENTAGE OF OCCURRENCE DURING ALL MOT TESTS
FAIL

USER ENTERED

696 UXW annual Faults by type

ALL REPORTED FAULTS, DISPLAYED over time and categorised by type
696 UXW annual Faults by type
ALL REPORTED FAULTS, DISPLAYED over time and categorised by type

ALL 696 UXW Failure Faults [16]

ALL Failure faults, ORDERED by OCCURRENCE DURING 696 UXW's MOT HISTORY
ALL 696 UXW Failure Faults [16]
ALL Failure faults, ORDERED by OCCURRENCE DURING 696 UXW's MOT HISTORY
Fail Faults | source www.vehiclestats.co.uk
Fault Fault Test Date Test Date/Time Reference MOT Test Reference
1 Front windscreen washer provides insufficient washer liquid (8.2.3) Front windscreen washer provides insufficient washer liquid (8.2.3) 19 February 2007 [15:11] 19/02/2007 911060857061 911060857061
1 Front an item not tested (manual) Front an item not tested (manual) 19 February 2007 [15:11] 19/02/2007 911060857061 911060857061
1 Indicator tell tale inoperative (1.4.a.2a) Indicator tell tale inoperative (1.4.a.2a) 19 February 2007 [15:11] 19/02/2007 911060857061 911060857061
1 Offside rear shock absorber has an excessively worn bush (2.7.4) Offside rear shock absorber has an excessively worn bush (2.7.4) 19 February 2007 [15:11] 19/02/2007 911060857061 911060857061
1 Nearside rear brake binding (3.7.b.1) Nearside rear brake binding (3.7.b.1) 19 February 2007 [15:11] 19/02/2007 911060857061 911060857061
1 Nearside rear parking brake recording little or no effort (3.7.b.6a) Nearside rear parking brake recording little or no effort (3.7.b.6a) 19 February 2007 [15:11] 19/02/2007 911060857061 911060857061
1 Parking brake: efficiency below requirements (3.7.b.7) Parking brake: efficiency below requirements (3.7.b.7) 19 February 2007 [15:11] 19/02/2007 911060857061 911060857061
1 Nearside front windscreen wiper does not clear the windscreen effectively (8.2.2) Nearside front windscreen wiper does not clear the windscreen effectively (8.2.2) 05 January 2006 [15:40] 05/01/2006 641625006091 641625006091
1 Offside front windscreen wiper does not clear the windscreen effectively (8.2.2) Offside front windscreen wiper does not clear the windscreen effectively (8.2.2) 05 January 2006 [15:40] 05/01/2006 641625006091 641625006091
1 Offside front headlamp not working on main beam (1.7.5a) Offside front headlamp not working on main beam (1.7.5a) 05 January 2006 [15:40] 05/01/2006 641625006091 641625006091
1 Offside rear rear position lamp(s) excessively deteriorated so that it is not visible from a reasonable distance (1.1.a.3d) Offside rear rear position lamp(s) excessively deteriorated so that it is not visible from a reasonable distance (1.1.a.3d) 05 January 2006 [15:40] 05/01/2006 641625006091 641625006091
1 Nearside rear leaf spring has a deteriorated anchor pin rubber bush resulting in excessive movement (2.4.b.2) Nearside rear leaf spring has a deteriorated anchor pin rubber bush resulting in excessive movement (2.4.b.2) 05 January 2006 [15:40] 05/01/2006 641625006091 641625006091
1 Offside rear leaf spring has a deteriorated anchor pin rubber bush resulting in excessive movement (2.4.b.2) Offside rear leaf spring has a deteriorated anchor pin rubber bush resulting in excessive movement (2.4.b.2) 05 January 2006 [15:40] 05/01/2006 641625006091 641625006091
1 Nearside rear wheel cylinder has restricted free movement (3.5.1k) Nearside rear wheel cylinder has restricted free movement (3.5.1k) 05 January 2006 [15:40] 05/01/2006 641625006091 641625006091
1 Nearside front wheel cylinder has restricted free movement (3.5.1k) Nearside front wheel cylinder has restricted free movement (3.5.1k) 05 January 2006 [15:40] 05/01/2006 641625006091 641625006091
1 Brakes imbalanced across an axle (3.7.b.5b) Brakes imbalanced across an axle (3.7.b.5b) 05 January 2006 [15:40] 05/01/2006 641625006091 641625006091

ALL 696 UXW User Entered Faults [3]

ALL User Entered faults, ORDERED by OCCURRENCE DURING 696 UXW's MOT HISTORY
ALL 696 UXW User Entered Faults [3]
ALL User Entered faults, ORDERED by OCCURRENCE DURING 696 UXW's MOT HISTORY
Fail Faults | source www.vehiclestats.co.uk
Fault Fault Test Date Test Date/Time Reference MOT Test Reference
1 O/s/r inner step sill corerowed O/s/r inner step sill corerowed 05 January 2006 [15:40] 05/01/2006 641625006091 641625006091
1 Some surface corerowion to metal brake pipes Some surface corerowion to metal brake pipes 05 January 2006 [15:40] 05/01/2006 641625006091 641625006091
1 Slight play in both front wheel bearings Slight play in both front wheel bearings 05 January 2006 [15:40] 05/01/2006 641625006091 641625006091

MOT TEST: 04 April 2013 11:17:28 PASSED
MOT TEST: 04 April 2013 11:17:28 PASSED

This test (736934293059) was completed on the 04 April 2013 11:17:28 and PASSED the requirements for a valid MOT with 0 comments.

This test (736934293059) was completed on the 04 April 2013 11:17:28 and PASSED the requirements for a valid MOT with 0 comments.

Recorded mileage: 39,021

Recorded mileage: 39,021


MOT TEST: 13 March 2012 11:55:38 PASSED
MOT TEST: 13 March 2012 11:55:38 PASSED

This test (818703372074) was completed on the 13 March 2012 11:55:38 and PASSED the requirements for a valid MOT with 0 comments.

This test (818703372074) was completed on the 13 March 2012 11:55:38 and PASSED the requirements for a valid MOT with 0 comments.

Recorded mileage: 38,835

Recorded mileage: 38,835


MOT TEST: 15 March 2011 11:58:15 PASSED
MOT TEST: 15 March 2011 11:58:15 PASSED

This test (755674071011) was completed on the 15 March 2011 11:58:15 and PASSED the requirements for a valid MOT with 0 comments.

This test (755674071011) was completed on the 15 March 2011 11:58:15 and PASSED the requirements for a valid MOT with 0 comments.

Recorded mileage: 38,721

Recorded mileage: 38,721


MOT TEST: 15 March 2010 11:50:25 PASSED
MOT TEST: 15 March 2010 11:50:25 PASSED

This test (832534370036) was completed on the 15 March 2010 11:50:25 and PASSED the requirements for a valid MOT with 0 comments.

This test (832534370036) was completed on the 15 March 2010 11:50:25 and PASSED the requirements for a valid MOT with 0 comments.

Recorded mileage: 38,703

Recorded mileage: 38,703


MOT TEST: 11 March 2009 11:39:35 PASSED
MOT TEST: 11 March 2009 11:39:35 PASSED

This test (842560179097) was completed on the 11 March 2009 11:39:35 and PASSED the requirements for a valid MOT with 0 comments.

This test (842560179097) was completed on the 11 March 2009 11:39:35 and PASSED the requirements for a valid MOT with 0 comments.

Recorded mileage: 38,288

Recorded mileage: 38,288


MOT TEST: 20 February 2008 10:32:13 PASSED
MOT TEST: 20 February 2008 10:32:13 PASSED

This test (301491858023) was completed on the 20 February 2008 10:32:13 and PASSED the requirements for a valid MOT with 0 comments.

This test (301491858023) was completed on the 20 February 2008 10:32:13 and PASSED the requirements for a valid MOT with 0 comments.

Recorded mileage: 38,072

Recorded mileage: 38,072


MOT TEST: 16 March 2007 12:19:28 PASSED
MOT TEST: 16 March 2007 12:19:28 PASSED

This test (183635877431) was completed on the 16 March 2007 12:19:28 and PASSED the requirements for a valid MOT with 0 comments.

This test (183635877431) was completed on the 16 March 2007 12:19:28 and PASSED the requirements for a valid MOT with 0 comments.

Recorded mileage: 37,681

Recorded mileage: 37,681


MOT TEST: 19 February 2007 15:11:14 FAILED
MOT TEST: 19 February 2007 15:11:14 FAILED

This test (911060857061) was completed on the 19 February 2007 15:11:14 and FAILED the requirements for a valid MOT with 7 comments.

This test (911060857061) was completed on the 19 February 2007 15:11:14 and FAILED the requirements for a valid MOT with 7 comments.

Recorded mileage: 37,681

Recorded mileage: 37,681


FAIL


MOT TEST: 17 January 2006 16:07:00 PASSED
MOT TEST: 17 January 2006 16:07:00 PASSED

This test (793037816013) was completed on the 17 January 2006 16:07:00 and PASSED the requirements for a valid MOT with 0 comments.

This test (793037816013) was completed on the 17 January 2006 16:07:00 and PASSED the requirements for a valid MOT with 0 comments.

Recorded mileage: 37,528

Recorded mileage: 37,528


MOT TEST: 05 January 2006 15:40:05 FAILED
MOT TEST: 05 January 2006 15:40:05 FAILED

This test (641625006091) was completed on the 05 January 2006 15:40:05 and FAILED the requirements for a valid MOT with 12 comments.

This test (641625006091) was completed on the 05 January 2006 15:40:05 and FAILED the requirements for a valid MOT with 12 comments.

Recorded mileage: 37,528

Recorded mileage: 37,528


FAIL

USER ENTERED