697 VMA


697VMA is registered to a Blue 1969, Morris Minor 1000 with a Petrol engine. It Failed its most recent MOT Test on the 14 March 2018

39 unique faults (40 Total) reported in its MOT History (17 Tests).

1 common/recurring faults.

71% (12) MOT Pass Rate and a 29% (5) MOT Failure Rate.

672,170 recorded miles.

697 VMA


697VMA is registered to a Blue 1969, Morris Minor 1000 with a Petrol engine. It Failed its most recent MOT Test on the 14 March 2018

39 unique faults (40 Total) reported in its MOT History (17 Tests).

1 common/recurring faults.

71% (12) MOT Pass Rate and a 29% (5) MOT Failure Rate.

672,170 recorded miles.

MOT PASS/Failure rate for 697 VMA

all MOT test results for 697 VMA represented as a percentage
MOT PASS/Failure rate for 697 VMA
all MOT test results for 697 VMA represented as a percentage

PERCENTAGE OF VEHICLE FAULTS WITH 697 VMA

ALL REPORTED FAULTS, DISPLAYED BY PERCENTAGE OF OCCURRENCE DURING ALL MOT TESTS
PERCENTAGE OF VEHICLE FAULTS WITH 697 VMA
ALL REPORTED FAULTS, DISPLAYED BY PERCENTAGE OF OCCURRENCE DURING ALL MOT TESTS
ADVISORY

FAIL

USER ENTERED

697 VMA annual Faults by type

ALL REPORTED FAULTS, DISPLAYED over time and categorised by type
697 VMA annual Faults by type
ALL REPORTED FAULTS, DISPLAYED over time and categorised by type

ALL 697 VMA ADVISORIES [5]

ALL ADVISORIES, ORDERED by OCCURRENCE DURING 697 VMA's MOT HISTORY
ALL 697 VMA ADVISORIES [5]
ALL ADVISORIES, ORDERED by OCCURRENCE DURING 697 VMA's MOT HISTORY
Fail Faults | source www.vehiclestats.co.uk
Fault Fault Test Date Test Date/Time Reference MOT Test Reference
1 Both front shock absorber lower bushes deteriorated Both front shock absorber lower bushes deteriorated 14 March 2018 [09:59] 14/03/2018 338701830861 338701830861
1 Offside inner sill corroded Offside inner sill corroded 14 March 2018 [09:59] 14/03/2018 338701830861 338701830861
1 Exhaust has a minor leak of exhaust gases (7.1.2) Exhaust has a minor leak of exhaust gases (7.1.2) 12 April 2008 [12:59] 12/04/2008 214283808459 214283808459
1 Rear parking brake: parking brake efficiency only just met. It would appear that the braking system requires adjustment or repair. (3.7.b.7) Rear parking brake: parking brake efficiency only just met. It would appear that the braking system requires adjustment or repair. (3.7.b.7) 11 April 2007 [12:41] 11/04/2007 264651907127 264651907127
1 Rear service brake: service brake efficiency only just met. It would appear that the braking system requires adjustment or repair. (3.7.b.7) Rear service brake: service brake efficiency only just met. It would appear that the braking system requires adjustment or repair. (3.7.b.7) 11 April 2007 [12:41] 11/04/2007 264651907127 264651907127

ALL 697 VMA Failure Faults [30]

ALL Failure faults, ORDERED by OCCURRENCE DURING 697 VMA's MOT HISTORY
ALL 697 VMA Failure Faults [30]
ALL Failure faults, ORDERED by OCCURRENCE DURING 697 VMA's MOT HISTORY
Fail Faults | source www.vehiclestats.co.uk
Fault Fault Test Date Test Date/Time Reference MOT Test Reference
2 Nearside rear body or chassis has excessive corrosion, seriously affecting its strength within 30cm of the body mountings (6.1.b.2) Nearside rear body or chassis has excessive corrosion, seriously affecting its strength within 30cm of the body mountings (6.1.b.2) 18 March 2015 [10:04] 18/03/2015 08 February 2011 [11:56] 08/02/2011 437927175045 437927175045 846159931037 846159931037
1 Indicator tell tale inoperative (1.4.a.2a) Indicator tell tale inoperative (1.4.a.2a) 14 March 2018 [09:59] 14/03/2018 338701830861 338701830861
1 Offside rear seat belt locking mechanism does not secure or release under load (5.2.5a) Offside rear seat belt locking mechanism does not secure or release under load (5.2.5a) 14 March 2018 [09:59] 14/03/2018 338701830861 338701830861
1 Central rear seat belt locking mechanism does not secure or release under load (5.2.5a) Central rear seat belt locking mechanism does not secure or release under load (5.2.5a) 14 March 2018 [09:59] 14/03/2018 338701830861 338701830861
1 Nearside rear seat belt retracting mechanism defective (5.2.5b) Nearside rear seat belt retracting mechanism defective (5.2.5b) 14 March 2018 [09:59] 14/03/2018 338701830861 338701830861
1 Nearside registration plate lamp not working (1.1.c.1d) Nearside registration plate lamp not working (1.1.c.1d) 14 March 2018 [09:59] 14/03/2018 338701830861 338701830861
1 Offside registration plate lamp not working (1.1.c.1d) Offside registration plate lamp not working (1.1.c.1d) 14 March 2018 [09:59] 14/03/2018 338701830861 338701830861
1 Fuel cap/sealing device sealing washer deteriorated (7.2.4c) Fuel cap/sealing device sealing washer deteriorated (7.2.4c) 14 March 2018 [09:59] 14/03/2018 338701830861 338701830861
1 Nearside front anti-roll bar synthetic bush deteriorated resulting in excessive movement (2.4.g.2) Nearside front anti-roll bar synthetic bush deteriorated resulting in excessive movement (2.4.g.2) 14 March 2018 [09:59] 14/03/2018 338701830861 338701830861
1 Offside front seat belt anchorage prescribed area is excessively corroded inner sill (5.2.6) Offside front seat belt anchorage prescribed area is excessively corroded inner sill (5.2.6) 14 March 2018 [09:59] 14/03/2018 338701830861 338701830861
1 Offside rear suspension spring mounting prescribed area is excessively corroded (2.4.a.3) Offside rear suspension spring mounting prescribed area is excessively corroded (2.4.a.3) 14 March 2018 [09:59] 14/03/2018 338701830861 338701830861
1 Nearside front front wheel bearing rough when rotated (2.5.a.2) Nearside front front wheel bearing rough when rotated (2.5.a.2) 14 March 2018 [09:59] 14/03/2018 338701830861 338701830861
1 Front brake application uneven (3.7.b.2) Front brake application uneven (3.7.b.2) 14 March 2018 [09:59] 14/03/2018 338701830861 338701830861
1 Registration plate lamp not working (1.1.c.1d) Registration plate lamp not working (1.1.c.1d) 18 March 2015 [10:04] 18/03/2015 437927175045 437927175045
1 Offside rear parking brake recording little or no effort (3.7.b.6a) Offside rear parking brake recording little or no effort (3.7.b.6a) 18 March 2015 [10:04] 18/03/2015 437927175045 437927175045
1 Offside rear body or chassis has excessive corrosion, seriously affecting its strength within 30cm of the body mountings (6.1.b.2) Offside rear body or chassis has excessive corrosion, seriously affecting its strength within 30cm of the body mountings (6.1.b.2) 18 March 2015 [10:04] 18/03/2015 437927175045 437927175045
1 Offside front body or chassis has excessive corrosion, seriously affecting its strength within 30cm of the body mountings (6.1.b.2) Offside front body or chassis has excessive corrosion, seriously affecting its strength within 30cm of the body mountings (6.1.b.2) 18 March 2015 [10:04] 18/03/2015 437927175045 437927175045
1 Nearside front body or chassis has excessive corrosion, seriously affecting its strength within 30cm of the body mountings (6.1.b.2) Nearside front body or chassis has excessive corrosion, seriously affecting its strength within 30cm of the body mountings (6.1.b.2) 18 March 2015 [10:04] 18/03/2015 437927175045 437927175045
1 Parking brake: efficiency below requirements (3.7.b.7) Parking brake: efficiency below requirements (3.7.b.7) 18 March 2015 [10:04] 18/03/2015 437927175045 437927175045
1 Brakes imbalanced across an axle (3.7.b.5b) Brakes imbalanced across an axle (3.7.b.5b) 18 March 2015 [10:04] 18/03/2015 437927175045 437927175045
1 Offside body or chassis has excessive corrosion, seriously affecting its strength within 30cm of the body mountings (6.1.b.2) Offside body or chassis has excessive corrosion, seriously affecting its strength within 30cm of the body mountings (6.1.b.2) 08 February 2011 [11:56] 08/02/2011 846159931037 846159931037
1 Nearside front tyre fouling a part of the vehicle (4.1.d.2) Nearside front tyre fouling a part of the vehicle (4.1.d.2) 12 April 2008 [12:59] 12/04/2008 214283808459 214283808459
1 Offside front tyre fouling a part of the vehicle (4.1.d.2) Offside front tyre fouling a part of the vehicle (4.1.d.2) 12 April 2008 [12:59] 12/04/2008 214283808459 214283808459
1 Drivers seat cannot be secured in the upright position. (6.2.a.2) Drivers seat cannot be secured in the upright position. (6.2.a.2) 12 April 2008 [12:59] 12/04/2008 214283808459 214283808459
1 Front passenger seat cannot be secured in the upright position. (6.2.4) Front passenger seat cannot be secured in the upright position. (6.2.4) 12 April 2008 [12:59] 12/04/2008 214283808459 214283808459
1 Nearside rear leaf spring has excessive wear in a shackle pin and/or bush (2.4.b.2) Nearside rear leaf spring has excessive wear in a shackle pin and/or bush (2.4.b.2) 11 April 2007 [12:41] 11/04/2007 264651907127 264651907127
1 Front tie bar/rod rubber bush deteriorated resulting in excessive movement (2.4.g.2) Front tie bar/rod rubber bush deteriorated resulting in excessive movement (2.4.g.2) 11 April 2007 [12:41] 11/04/2007 264651907127 264651907127
1 Nearside front tyre tread depth below requirements of 1.6mm (4.1.e.1) Nearside front tyre tread depth below requirements of 1.6mm (4.1.e.1) 11 April 2007 [12:41] 11/04/2007 264651907127 264651907127
1 Front exhaust has a major leak of exhaust gases (7.1.2) Front exhaust has a major leak of exhaust gases (7.1.2) 11 April 2007 [12:41] 11/04/2007 264651907127 264651907127

ALL 697 VMA User Entered Faults [5]

ALL User Entered faults, ORDERED by OCCURRENCE DURING 697 VMA's MOT HISTORY
ALL 697 VMA User Entered Faults [5]
ALL User Entered faults, ORDERED by OCCURRENCE DURING 697 VMA's MOT HISTORY
User Entered Faults | source www.vehiclestats.co.uk
Fault Fault Test Date Test Date/Time Reference MOT Test Reference
1 Chassis corroded Chassis corroded 03 April 2009 [12:06] 03/04/2009 370373499001 370373499001
1 Sills and floor corroded Sills and floor corroded 03 April 2009 [12:06] 03/04/2009 370373499001 370373499001
1 Clun k fron front suspension Clun k fron front suspension 03 April 2009 [12:06] 03/04/2009 370373499001 370373499001
1 Oil leak Oil leak 12 April 2008 [12:59] 12/04/2008 214283808459 214283808459
1 Near side front top trunion bushes slightly worn. †near side rear top spring shackle bolt slightly insecure. †front brakes slightly out of balance. Near side front top trunion bushes slightly worn. †near side rear top spring shackle bolt slightly insecure. †front brakes slightly out of balance. 28 March 2006 [14:43] 28/03/2006 112967986032 112967986032

MOT TEST: 14 March 2018 09:59:57 FAILED
MOT TEST: 14 March 2018 09:59:57 FAILED

This test (338701830861) was completed on the 14 March 2018 09:59:57 and FAILED the requirements for a valid MOT with 14 comments.

This test (338701830861) was completed on the 14 March 2018 09:59:57 and FAILED the requirements for a valid MOT with 14 comments.

Recorded mileage: 81,149

Recorded mileage: 81,149


ADVISORY

FAIL


MOT TEST: 20 March 2017 16:43:25 PASSED
MOT TEST: 20 March 2017 16:43:25 PASSED

This test (342922550217) was completed on the 20 March 2017 16:43:25 and PASSED the requirements for a valid MOT with 0 comments.

This test (342922550217) was completed on the 20 March 2017 16:43:25 and PASSED the requirements for a valid MOT with 0 comments.

Recorded mileage: 75,761

Recorded mileage: 75,761


MOT TEST: 06 April 2016 08:00:10 PASSED
MOT TEST: 06 April 2016 08:00:10 PASSED

This test (807382406794) was completed on the 06 April 2016 08:00:10 and PASSED the requirements for a valid MOT with 0 comments.

This test (807382406794) was completed on the 06 April 2016 08:00:10 and PASSED the requirements for a valid MOT with 0 comments.

Recorded mileage: 74,450

Recorded mileage: 74,450


MOT TEST: 23 April 2015 17:09:37 PASSED
MOT TEST: 23 April 2015 17:09:37 PASSED

This test (937263115177) was completed on the 23 April 2015 17:09:37 and PASSED the requirements for a valid MOT with 0 comments.

This test (937263115177) was completed on the 23 April 2015 17:09:37 and PASSED the requirements for a valid MOT with 0 comments.

Recorded mileage: 74,066

Recorded mileage: 74,066


MOT TEST: 18 March 2015 10:04:43 FAILED
MOT TEST: 18 March 2015 10:04:43 FAILED

This test (437927175045) was completed on the 18 March 2015 10:04:43 and FAILED the requirements for a valid MOT with 8 comments.

This test (437927175045) was completed on the 18 March 2015 10:04:43 and FAILED the requirements for a valid MOT with 8 comments.

Recorded mileage: 74,006

Recorded mileage: 74,006


FAIL


MOT TEST: 24 March 2014 16:40:49 PASSED
MOT TEST: 24 March 2014 16:40:49 PASSED

This test (887423084099) was completed on the 24 March 2014 16:40:49 and PASSED the requirements for a valid MOT with 0 comments.

This test (887423084099) was completed on the 24 March 2014 16:40:49 and PASSED the requirements for a valid MOT with 0 comments.

Recorded mileage: 73,227

Recorded mileage: 73,227


MOT TEST: 26 February 2013 11:45:31 PASSED
MOT TEST: 26 February 2013 11:45:31 PASSED

This test (298397353029) was completed on the 26 February 2013 11:45:31 and PASSED the requirements for a valid MOT with 0 comments.

This test (298397353029) was completed on the 26 February 2013 11:45:31 and PASSED the requirements for a valid MOT with 0 comments.

Recorded mileage: 72,402

Recorded mileage: 72,402


MOT TEST: 24 February 2012 08:41:57 PASSED
MOT TEST: 24 February 2012 08:41:57 PASSED

This test (157465952408) was completed on the 24 February 2012 08:41:57 and PASSED the requirements for a valid MOT with 0 comments.

This test (157465952408) was completed on the 24 February 2012 08:41:57 and PASSED the requirements for a valid MOT with 0 comments.

Recorded mileage: 71,939

Recorded mileage: 71,939


MOT TEST: 18 February 2011 06:58:09 PASSED
MOT TEST: 18 February 2011 06:58:09 PASSED

This test (737119341082) was completed on the 18 February 2011 06:58:09 and PASSED the requirements for a valid MOT with 0 comments.

This test (737119341082) was completed on the 18 February 2011 06:58:09 and PASSED the requirements for a valid MOT with 0 comments.

Recorded mileage: 70,896

Recorded mileage: 70,896


MOT TEST: 08 February 2011 11:56:16 FAILED
MOT TEST: 08 February 2011 11:56:16 FAILED

This test (846159931037) was completed on the 08 February 2011 11:56:16 and FAILED the requirements for a valid MOT with 2 comments.

This test (846159931037) was completed on the 08 February 2011 11:56:16 and FAILED the requirements for a valid MOT with 2 comments.

Recorded mileage: 70,891

Recorded mileage: 70,891


FAIL


MOT TEST: 03 March 2010 12:01:11 PASSED
MOT TEST: 03 March 2010 12:01:11 PASSED

This test (240222060077) was completed on the 03 March 2010 12:01:11 and PASSED the requirements for a valid MOT with 0 comments.

This test (240222060077) was completed on the 03 March 2010 12:01:11 and PASSED the requirements for a valid MOT with 0 comments.

Recorded mileage: 67,891

Recorded mileage: 67,891


MOT TEST: 03 April 2009 12:06:17 PASSED
MOT TEST: 03 April 2009 12:06:17 PASSED

This test (370373499001) was completed on the 03 April 2009 12:06:17 and PASSED the requirements for a valid MOT with 3 comments.

This test (370373499001) was completed on the 03 April 2009 12:06:17 and PASSED the requirements for a valid MOT with 3 comments.

Recorded mileage: 672,170

Recorded mileage: 672,170


USER ENTERED


MOT TEST: 12 April 2008 14:08:41 PASSED
MOT TEST: 12 April 2008 14:08:41 PASSED

This test (350243008142) was completed on the 12 April 2008 14:08:41 and PASSED the requirements for a valid MOT with 0 comments.

This test (350243008142) was completed on the 12 April 2008 14:08:41 and PASSED the requirements for a valid MOT with 0 comments.

Recorded mileage: 65,421

Recorded mileage: 65,421


MOT TEST: 12 April 2008 12:59:36 FAILED
MOT TEST: 12 April 2008 12:59:36 FAILED

This test (214283808459) was completed on the 12 April 2008 12:59:36 and FAILED the requirements for a valid MOT with 6 comments.

This test (214283808459) was completed on the 12 April 2008 12:59:36 and FAILED the requirements for a valid MOT with 6 comments.

Recorded mileage: 65,421

Recorded mileage: 65,421


ADVISORY

FAIL

USER ENTERED


MOT TEST: 24 April 2007 14:01:45 PASSED
MOT TEST: 24 April 2007 14:01:45 PASSED

This test (323404217116) was completed on the 24 April 2007 14:01:45 and PASSED the requirements for a valid MOT with 0 comments.

This test (323404217116) was completed on the 24 April 2007 14:01:45 and PASSED the requirements for a valid MOT with 0 comments.

Recorded mileage: 633,950

Recorded mileage: 633,950


MOT TEST: 11 April 2007 12:41:57 FAILED
MOT TEST: 11 April 2007 12:41:57 FAILED

This test (264651907127) was completed on the 11 April 2007 12:41:57 and FAILED the requirements for a valid MOT with 6 comments.

This test (264651907127) was completed on the 11 April 2007 12:41:57 and FAILED the requirements for a valid MOT with 6 comments.

Recorded mileage: 63,329

Recorded mileage: 63,329


ADVISORY

FAIL


MOT TEST: 28 March 2006 14:43:38 PASSED
MOT TEST: 28 March 2006 14:43:38 PASSED

This test (112967986032) was completed on the 28 March 2006 14:43:38 and PASSED the requirements for a valid MOT with 1 comments.

This test (112967986032) was completed on the 28 March 2006 14:43:38 and PASSED the requirements for a valid MOT with 1 comments.

Recorded mileage: 57,938

Recorded mileage: 57,938


USER ENTERED