698 BKP


698BKP is registered to a Grey 1958, Morris Minor with a Petrol engine. It Failed its most recent MOT Test on the 12 November 2012

10 unique faults (10 Total) reported in its MOT History (12 Tests).

0 common/recurring faults.

67% (8) MOT Pass Rate and a 33% (4) MOT Failure Rate.

10,801 recorded miles.

698 BKP


698BKP is registered to a Grey 1958, Morris Minor with a Petrol engine. It Failed its most recent MOT Test on the 12 November 2012

10 unique faults (10 Total) reported in its MOT History (12 Tests).

0 common/recurring faults.

67% (8) MOT Pass Rate and a 33% (4) MOT Failure Rate.

10,801 recorded miles.

MOT PASS/Failure rate for 698 BKP

all MOT test results for 698 BKP represented as a percentage
MOT PASS/Failure rate for 698 BKP
all MOT test results for 698 BKP represented as a percentage

PERCENTAGE OF VEHICLE FAULTS WITH 698 BKP

ALL REPORTED FAULTS, DISPLAYED BY PERCENTAGE OF OCCURRENCE DURING ALL MOT TESTS
PERCENTAGE OF VEHICLE FAULTS WITH 698 BKP
ALL REPORTED FAULTS, DISPLAYED BY PERCENTAGE OF OCCURRENCE DURING ALL MOT TESTS
FAIL

698 BKP annual Faults by type

ALL REPORTED FAULTS, DISPLAYED over time and categorised by type
698 BKP annual Faults by type
ALL REPORTED FAULTS, DISPLAYED over time and categorised by type

ALL 698 BKP Failure Faults [10]

ALL Failure faults, ORDERED by OCCURRENCE DURING 698 BKP's MOT HISTORY
ALL 698 BKP Failure Faults [10]
ALL Failure faults, ORDERED by OCCURRENCE DURING 698 BKP's MOT HISTORY
Fail Faults | source www.vehiclestats.co.uk
Fault Fault Test Date Test Date/Time Reference MOT Test Reference
1 Nearside rear vehicle structure has excessive corrosion, seriously affecting its strength within 30cm of the body mountings (6.1.b.2) Nearside rear vehicle structure has excessive corrosion, seriously affecting its strength within 30cm of the body mountings (6.1.b.2) 27 October 2010 [12:06] 27/10/2010 623710200395 623710200395
1 Offside rear vehicle structure has excessive corrosion, seriously affecting its strength within 30cm of the body mountings (6.1.b.2) Offside rear vehicle structure has excessive corrosion, seriously affecting its strength within 30cm of the body mountings (6.1.b.2) 27 October 2010 [12:06] 27/10/2010 623710200395 623710200395
1 Nearside front vehicle structure has excessive corrosion, seriously affecting its strength within 30cm of the body mountings (6.1.b.2) Nearside front vehicle structure has excessive corrosion, seriously affecting its strength within 30cm of the body mountings (6.1.b.2) 27 October 2010 [12:06] 27/10/2010 623710200395 623710200395
1 Offside front vehicle structure has excessive corrosion, seriously affecting its strength within 30cm of the body mountings (6.1.b.2) Offside front vehicle structure has excessive corrosion, seriously affecting its strength within 30cm of the body mountings (6.1.b.2) 27 October 2010 [12:06] 27/10/2010 623710200395 623710200395
1 Nearside rear brake recording little or no effort (3.7.b.5a) Nearside rear brake recording little or no effort (3.7.b.5a) 23 October 2008 [10:55] 23/10/2008 194297198257 194297198257
1 Nearside rear parking brake recording little or no effort (3.7.b.6a) Nearside rear parking brake recording little or no effort (3.7.b.6a) 23 October 2008 [10:55] 23/10/2008 194297198257 194297198257
1 Brakes imbalanced across an axle (3.7.b.5b) Brakes imbalanced across an axle (3.7.b.5b) 19 October 2006 [10:24] 19/10/2006 520592096273 520592096273
1 Offside rear lower brake pipe leaking (3.6.a.1) Offside rear lower brake pipe leaking (3.6.a.1) 14 October 2005 [11:17] 14/10/2005 244197785258 244197785258
1 Service brake: efficiency below requirements (3.7.b.7) Service brake: efficiency below requirements (3.7.b.7) 14 October 2005 [11:17] 14/10/2005 244197785258 244197785258
1 Parking brake: efficiency below requirements (3.7.b.7) Parking brake: efficiency below requirements (3.7.b.7) 14 October 2005 [11:17] 14/10/2005 244197785258 244197785258

MOT TEST: 12 November 2012 14:54:15 PASSED
MOT TEST: 12 November 2012 14:54:15 PASSED

This test (226837812326) was completed on the 12 November 2012 14:54:15 and PASSED the requirements for a valid MOT with 0 comments.

This test (226837812326) was completed on the 12 November 2012 14:54:15 and PASSED the requirements for a valid MOT with 0 comments.

Recorded mileage: 10,801

Recorded mileage: 10,801


MOT TEST: 09 November 2011 14:34:21 PASSED
MOT TEST: 09 November 2011 14:34:21 PASSED

This test (939253711349) was completed on the 09 November 2011 14:34:21 and PASSED the requirements for a valid MOT with 0 comments.

This test (939253711349) was completed on the 09 November 2011 14:34:21 and PASSED the requirements for a valid MOT with 0 comments.

Recorded mileage: 10,539

Recorded mileage: 10,539


MOT TEST: 12 November 2010 10:33:40 PASSED
MOT TEST: 12 November 2010 10:33:40 PASSED

This test (320276210322) was completed on the 12 November 2010 10:33:40 and PASSED the requirements for a valid MOT with 0 comments.

This test (320276210322) was completed on the 12 November 2010 10:33:40 and PASSED the requirements for a valid MOT with 0 comments.

Recorded mileage: 9,932

Recorded mileage: 9,932


MOT TEST: 27 October 2010 12:06:32 FAILED
MOT TEST: 27 October 2010 12:06:32 FAILED

This test (623710200395) was completed on the 27 October 2010 12:06:32 and FAILED the requirements for a valid MOT with 4 comments.

This test (623710200395) was completed on the 27 October 2010 12:06:32 and FAILED the requirements for a valid MOT with 4 comments.

Recorded mileage: 9,908

Recorded mileage: 9,908


FAIL


MOT TEST: 28 October 2009 15:22:00 PASSED
MOT TEST: 28 October 2009 15:22:00 PASSED

This test (722781009343) was completed on the 28 October 2009 15:22:00 and PASSED the requirements for a valid MOT with 0 comments.

This test (722781009343) was completed on the 28 October 2009 15:22:00 and PASSED the requirements for a valid MOT with 0 comments.

Recorded mileage: 9,030

Recorded mileage: 9,030


MOT TEST: 23 October 2008 15:07:14 PASSED
MOT TEST: 23 October 2008 15:07:14 PASSED

This test (673997698233) was completed on the 23 October 2008 15:07:14 and PASSED the requirements for a valid MOT with 0 comments.

This test (673997698233) was completed on the 23 October 2008 15:07:14 and PASSED the requirements for a valid MOT with 0 comments.

Recorded mileage: 8,434

Recorded mileage: 8,434


MOT TEST: 23 October 2008 10:55:29 FAILED
MOT TEST: 23 October 2008 10:55:29 FAILED

This test (194297198257) was completed on the 23 October 2008 10:55:29 and FAILED the requirements for a valid MOT with 2 comments.

This test (194297198257) was completed on the 23 October 2008 10:55:29 and FAILED the requirements for a valid MOT with 2 comments.

Recorded mileage: 8,434

Recorded mileage: 8,434


FAIL


MOT TEST: 24 October 2007 15:59:54 PASSED
MOT TEST: 24 October 2007 15:59:54 PASSED

This test (394787797416) was completed on the 24 October 2007 15:59:54 and PASSED the requirements for a valid MOT with 0 comments.

This test (394787797416) was completed on the 24 October 2007 15:59:54 and PASSED the requirements for a valid MOT with 0 comments.

Recorded mileage: 7,886

Recorded mileage: 7,886


MOT TEST: 19 October 2006 15:21:33 PASSED
MOT TEST: 19 October 2006 15:21:33 PASSED

This test (513602096273) was completed on the 19 October 2006 15:21:33 and PASSED the requirements for a valid MOT with 0 comments.

This test (513602096273) was completed on the 19 October 2006 15:21:33 and PASSED the requirements for a valid MOT with 0 comments.

Recorded mileage: 6,892

Recorded mileage: 6,892


MOT TEST: 19 October 2006 10:24:13 FAILED
MOT TEST: 19 October 2006 10:24:13 FAILED

This test (520592096273) was completed on the 19 October 2006 10:24:13 and FAILED the requirements for a valid MOT with 1 comments.

This test (520592096273) was completed on the 19 October 2006 10:24:13 and FAILED the requirements for a valid MOT with 1 comments.

Recorded mileage: 6,892

Recorded mileage: 6,892


FAIL


MOT TEST: 17 October 2005 14:52:55 PASSED
MOT TEST: 17 October 2005 14:52:55 PASSED

This test (661430995278) was completed on the 17 October 2005 14:52:55 and PASSED the requirements for a valid MOT with 0 comments.

This test (661430995278) was completed on the 17 October 2005 14:52:55 and PASSED the requirements for a valid MOT with 0 comments.

Recorded mileage: 5,913

Recorded mileage: 5,913


MOT TEST: 14 October 2005 11:17:24 FAILED
MOT TEST: 14 October 2005 11:17:24 FAILED

This test (244197785258) was completed on the 14 October 2005 11:17:24 and FAILED the requirements for a valid MOT with 3 comments.

This test (244197785258) was completed on the 14 October 2005 11:17:24 and FAILED the requirements for a valid MOT with 3 comments.

Recorded mileage: 5,913

Recorded mileage: 5,913


FAIL