698 UPC


698UPC is registered to a Blue 1961, Morris Minor with a Petrol engine. It Failed its most recent MOT Test on the 01 August 2016

7 unique faults (7 Total) reported in its MOT History (4 Tests).

0 common/recurring faults.

75% (3) MOT Pass Rate and a 25% (1) MOT Failure Rate.

20,433 recorded miles.

698 UPC


698UPC is registered to a Blue 1961, Morris Minor with a Petrol engine. It Failed its most recent MOT Test on the 01 August 2016

7 unique faults (7 Total) reported in its MOT History (4 Tests).

0 common/recurring faults.

75% (3) MOT Pass Rate and a 25% (1) MOT Failure Rate.

20,433 recorded miles.

MOT PASS/Failure rate for 698 UPC

all MOT test results for 698 UPC represented as a percentage
MOT PASS/Failure rate for 698 UPC
all MOT test results for 698 UPC represented as a percentage

PERCENTAGE OF VEHICLE FAULTS WITH 698 UPC

ALL REPORTED FAULTS, DISPLAYED BY PERCENTAGE OF OCCURRENCE DURING ALL MOT TESTS
PERCENTAGE OF VEHICLE FAULTS WITH 698 UPC
ALL REPORTED FAULTS, DISPLAYED BY PERCENTAGE OF OCCURRENCE DURING ALL MOT TESTS
FAIL

698 UPC annual Faults by type

ALL REPORTED FAULTS, DISPLAYED over time and categorised by type
698 UPC annual Faults by type
ALL REPORTED FAULTS, DISPLAYED over time and categorised by type

ALL 698 UPC Failure Faults [7]

ALL Failure faults, ORDERED by OCCURRENCE DURING 698 UPC's MOT HISTORY
ALL 698 UPC Failure Faults [7]
ALL Failure faults, ORDERED by OCCURRENCE DURING 698 UPC's MOT HISTORY
Fail Faults | source www.vehiclestats.co.uk
Fault Fault Test Date Test Date/Time Reference MOT Test Reference
1 Offside front body or chassis has excessive corrosion, seriously affecting its strength within 30cm of the body mountings (6.1.b.2) Offside front body or chassis has excessive corrosion, seriously affecting its strength within 30cm of the body mountings (6.1.b.2) 28 July 2016 [09:07] 28/07/2016 463282214062 463282214062
1 Nearside front direction indicator not working (1.4.a.2c) Nearside front direction indicator not working (1.4.a.2c) 28 July 2016 [09:07] 28/07/2016 463282214062 463282214062
1 Registration plate lamp not working (1.1.c.1d) Registration plate lamp not working (1.1.c.1d) 28 July 2016 [09:07] 28/07/2016 463282214062 463282214062
1 Nearside front steering rack gaiter split (2.2.d.2d) Nearside front steering rack gaiter split (2.2.d.2d) 28 July 2016 [09:07] 28/07/2016 463282214062 463282214062
1 Nearside rear leaf spring has excessive wear in an anchor pin and/or bush (2.4.b.2) Nearside rear leaf spring has excessive wear in an anchor pin and/or bush (2.4.b.2) 28 July 2016 [09:07] 28/07/2016 463282214062 463282214062
1 Offside rear leaf spring has excessive wear in an anchor pin and/or bush (2.4.b.2) Offside rear leaf spring has excessive wear in an anchor pin and/or bush (2.4.b.2) 28 July 2016 [09:07] 28/07/2016 463282214062 463282214062
1 Front front brake binding both (3.7.b.1) Front front brake binding both (3.7.b.1) 28 July 2016 [09:07] 28/07/2016 463282214062 463282214062

MOT TEST: 01 August 2016 13:16:13 PASSED
MOT TEST: 01 August 2016 13:16:13 PASSED

This test (115621968272) was completed on the 01 August 2016 13:16:13 and PASSED the requirements for a valid MOT with 0 comments.

This test (115621968272) was completed on the 01 August 2016 13:16:13 and PASSED the requirements for a valid MOT with 0 comments.

Recorded mileage: 20,433

Recorded mileage: 20,433


MOT TEST: 28 July 2016 09:07:15 FAILED
MOT TEST: 28 July 2016 09:07:15 FAILED

This test (463282214062) was completed on the 28 July 2016 09:07:15 and FAILED the requirements for a valid MOT with 7 comments.

This test (463282214062) was completed on the 28 July 2016 09:07:15 and FAILED the requirements for a valid MOT with 7 comments.

Recorded mileage: 20,428

Recorded mileage: 20,428


FAIL


MOT TEST: 19 September 2007 15:21:05 PASSED
MOT TEST: 19 September 2007 15:21:05 PASSED

This test (512262567295) was completed on the 19 September 2007 15:21:05 and PASSED the requirements for a valid MOT with 0 comments.

This test (512262567295) was completed on the 19 September 2007 15:21:05 and PASSED the requirements for a valid MOT with 0 comments.

Recorded mileage: 20,390

Recorded mileage: 20,390


MOT TEST: 20 June 2006 16:06:24 PASSED
MOT TEST: 20 June 2006 16:06:24 PASSED

This test (543351576135) was completed on the 20 June 2006 16:06:24 and PASSED the requirements for a valid MOT with 0 comments.

This test (543351576135) was completed on the 20 June 2006 16:06:24 and PASSED the requirements for a valid MOT with 0 comments.

Recorded mileage: 20,380

Recorded mileage: 20,380