702 UYX


702UYX is registered to a Black 1956, Morris Minor 1000 with a Petrol engine. It Failed its most recent MOT Test on the 18 May 2012

10 unique faults (15 Total) reported in its MOT History (3 Tests).

4 common/recurring faults, the most frequent (3 times) is: slight scoring to screen.

67% (2) MOT Pass Rate and a 33% (1) MOT Failure Rate.

74,402 recorded miles.

702 UYX


702UYX is registered to a Black 1956, Morris Minor 1000 with a Petrol engine. It Failed its most recent MOT Test on the 18 May 2012

10 unique faults (15 Total) reported in its MOT History (3 Tests).

4 common/recurring faults, the most frequent (3 times) is: slight scoring to screen.

67% (2) MOT Pass Rate and a 33% (1) MOT Failure Rate.

74,402 recorded miles.

MOT PASS/Failure rate for 702 UYX

all MOT test results for 702 UYX represented as a percentage
MOT PASS/Failure rate for 702 UYX
all MOT test results for 702 UYX represented as a percentage

PERCENTAGE OF VEHICLE FAULTS WITH 702 UYX

ALL REPORTED FAULTS, DISPLAYED BY PERCENTAGE OF OCCURRENCE DURING ALL MOT TESTS
PERCENTAGE OF VEHICLE FAULTS WITH 702 UYX
ALL REPORTED FAULTS, DISPLAYED BY PERCENTAGE OF OCCURRENCE DURING ALL MOT TESTS
ADVISORY

FAIL

USER ENTERED

702 UYX annual Faults by type

ALL REPORTED FAULTS, DISPLAYED over time and categorised by type
702 UYX annual Faults by type
ALL REPORTED FAULTS, DISPLAYED over time and categorised by type

RECURRING FAULTS WITH 702 UYX

FAULTS THAT HAVE OCCURED MORE THAN ONCE DURING 702 UYX's MOT HISTORY
RECURRING FAULTS WITH 702 UYX
FAULTS THAT HAVE OCCURED MORE THAN ONCE DURING 702 UYX's MOT HISTORY
Fault Fault Test Date Test Date/Time Reference MOT Test Reference
3 Slight scoring to screen Slight scoring to screen 18 May 2012 [14:47] 18/05/2012 02 June 2011 [13:31] 02/06/2011 25 May 2011 [13:52] 25/05/2011 715889232124 715889232124 198673751113 198673751113 897025441125 897025441125
2 Steering column top bearing slightly worn (2.1.2c) Steering column top bearing slightly worn (2.1.2c) 02 June 2011 [13:31] 02/06/2011 25 May 2011 [13:52] 25/05/2011 198673751113 198673751113 897025441125 897025441125
2 Battery insecure Battery insecure 02 June 2011 [13:31] 02/06/2011 25 May 2011 [13:52] 25/05/2011 198673751113 198673751113 897025441125 897025441125
2 Fuel pipe/s corroded Fuel pipe/s corroded 02 June 2011 [13:31] 02/06/2011 25 May 2011 [13:52] 25/05/2011 198673751113 198673751113 897025441125 897025441125

ALL 702 UYX ADVISORIES [3]

ALL ADVISORIES, ORDERED by OCCURRENCE DURING 702 UYX's MOT HISTORY
ALL 702 UYX ADVISORIES [3]
ALL ADVISORIES, ORDERED by OCCURRENCE DURING 702 UYX's MOT HISTORY
Advisory Faults | source www.vehiclestats.co.uk
Fault Fault Test Date Test Date/Time Reference MOT Test Reference
2 Steering column top bearing slightly worn (2.1.2c) Steering column top bearing slightly worn (2.1.2c) 02 June 2011 [13:31] 02/06/2011 25 May 2011 [13:52] 25/05/2011 198673751113 198673751113 897025441125 897025441125
1 Nearside front shock absorber has a light misting of oil (2.7.3) Nearside front shock absorber has a light misting of oil (2.7.3) 18 May 2012 [14:47] 18/05/2012 715889232124 715889232124

ALL 702 UYX Failure Faults [5]

ALL Failure faults, ORDERED by OCCURRENCE DURING 702 UYX's MOT HISTORY
ALL 702 UYX Failure Faults [5]
ALL Failure faults, ORDERED by OCCURRENCE DURING 702 UYX's MOT HISTORY
Fail Faults | source www.vehiclestats.co.uk
Fault Fault Test Date Test Date/Time Reference MOT Test Reference
1 Nearside windscreen washer provides insufficient washer liquid (8.2.3) Nearside windscreen washer provides insufficient washer liquid (8.2.3) 25 May 2011 [13:52] 25/05/2011 897025441125 897025441125
1 Offside windscreen washer provides insufficient washer liquid (8.2.3) Offside windscreen washer provides insufficient washer liquid (8.2.3) 25 May 2011 [13:52] 25/05/2011 897025441125 897025441125
1 Nearside rear suspension spring mounting prescribed area is excessively corroded (2.4.a.3) Nearside rear suspension spring mounting prescribed area is excessively corroded (2.4.a.3) 25 May 2011 [13:52] 25/05/2011 897025441125 897025441125
1 Offside rear leaf spring fractured (2.4.b.1a) Offside rear leaf spring fractured (2.4.b.1a) 25 May 2011 [13:52] 25/05/2011 897025441125 897025441125
1 Offside front brake pipe fouled by moving parts (3.6.b.2a) Offside front brake pipe fouled by moving parts (3.6.b.2a) 25 May 2011 [13:52] 25/05/2011 897025441125 897025441125

ALL 702 UYX User Entered Faults [7]

ALL User Entered faults, ORDERED by OCCURRENCE DURING 702 UYX's MOT HISTORY
ALL 702 UYX User Entered Faults [7]
ALL User Entered faults, ORDERED by OCCURRENCE DURING 702 UYX's MOT HISTORY
Advisory Faults | source www.vehiclestats.co.uk
Fault Fault Test Date Test Date/Time Reference MOT Test Reference
3 Slight scoring to screen Slight scoring to screen 18 May 2012 [14:47] 18/05/2012 02 June 2011 [13:31] 02/06/2011 25 May 2011 [13:52] 25/05/2011 715889232124 715889232124 198673751113 198673751113 897025441125 897025441125
2 Battery insecure Battery insecure 02 June 2011 [13:31] 02/06/2011 25 May 2011 [13:52] 25/05/2011 198673751113 198673751113 897025441125 897025441125
2 Fuel pipe/s corroded Fuel pipe/s corroded 02 June 2011 [13:31] 02/06/2011 25 May 2011 [13:52] 25/05/2011 198673751113 198673751113 897025441125 897025441125

MOT TEST: 18 May 2012 14:47:03 PASSED
MOT TEST: 18 May 2012 14:47:03 PASSED

This test (715889232124) was completed on the 18 May 2012 14:47:03 and PASSED the requirements for a valid MOT with 2 comments.

This test (715889232124) was completed on the 18 May 2012 14:47:03 and PASSED the requirements for a valid MOT with 2 comments.

Recorded mileage: 74,402

Recorded mileage: 74,402


ADVISORY

USER ENTERED


MOT TEST: 02 June 2011 13:31:49 PASSED
MOT TEST: 02 June 2011 13:31:49 PASSED

This test (198673751113) was completed on the 02 June 2011 13:31:49 and PASSED the requirements for a valid MOT with 4 comments.

This test (198673751113) was completed on the 02 June 2011 13:31:49 and PASSED the requirements for a valid MOT with 4 comments.

Recorded mileage: 73,981

Recorded mileage: 73,981


ADVISORY

USER ENTERED


MOT TEST: 25 May 2011 13:52:34 FAILED
MOT TEST: 25 May 2011 13:52:34 FAILED

This test (897025441125) was completed on the 25 May 2011 13:52:34 and FAILED the requirements for a valid MOT with 9 comments.

This test (897025441125) was completed on the 25 May 2011 13:52:34 and FAILED the requirements for a valid MOT with 9 comments.

Recorded mileage: 73,980

Recorded mileage: 73,980


ADVISORY

FAIL

USER ENTERED