710 CBK


710CBK is registered to a Green 1963, Morris Minor 1000 with a Petrol engine. It Failed its most recent MOT Test on the 19 November 2014

15 unique faults (18 Total) reported in its MOT History (9 Tests).

3 common/recurring faults, the most frequent (2 times) is: Nearside Rear Shock absorber has a slightly worn linkage (2.7.4).

56% (5) MOT Pass Rate and a 44% (4) MOT Failure Rate.

16,620 recorded miles.

710 CBK


710CBK is registered to a Green 1963, Morris Minor 1000 with a Petrol engine. It Failed its most recent MOT Test on the 19 November 2014

15 unique faults (18 Total) reported in its MOT History (9 Tests).

3 common/recurring faults, the most frequent (2 times) is: Nearside Rear Shock absorber has a slightly worn linkage (2.7.4).

56% (5) MOT Pass Rate and a 44% (4) MOT Failure Rate.

16,620 recorded miles.

MOT PASS/Failure rate for 710 CBK

all MOT test results for 710 CBK represented as a percentage
MOT PASS/Failure rate for 710 CBK
all MOT test results for 710 CBK represented as a percentage

PERCENTAGE OF VEHICLE FAULTS WITH 710 CBK

ALL REPORTED FAULTS, DISPLAYED BY PERCENTAGE OF OCCURRENCE DURING ALL MOT TESTS
PERCENTAGE OF VEHICLE FAULTS WITH 710 CBK
ALL REPORTED FAULTS, DISPLAYED BY PERCENTAGE OF OCCURRENCE DURING ALL MOT TESTS
ADVISORY

FAIL

USER ENTERED

710 CBK annual Faults by type

ALL REPORTED FAULTS, DISPLAYED over time and categorised by type
710 CBK annual Faults by type
ALL REPORTED FAULTS, DISPLAYED over time and categorised by type

RECURRING FAULTS WITH 710 CBK

FAULTS THAT HAVE OCCURED MORE THAN ONCE DURING 710 CBK's MOT HISTORY
RECURRING FAULTS WITH 710 CBK
FAULTS THAT HAVE OCCURED MORE THAN ONCE DURING 710 CBK's MOT HISTORY
Fault Fault Test Date Test Date/Time Reference MOT Test Reference
2 Nearside rear shock absorber has a slightly worn linkage (2.7.4) Nearside rear shock absorber has a slightly worn linkage (2.7.4) 19 November 2014 [14:59] 19/11/2014 19 November 2014 [11:43] 19/11/2014 406173824328 406173824328 776453024332 776453024332
2 Offside rear shock absorber has a slightly worn bush (2.7.4) Offside rear shock absorber has a slightly worn bush (2.7.4) 19 November 2014 [14:59] 19/11/2014 19 November 2014 [11:43] 19/11/2014 406173824328 406173824328 776453024332 776453024332
2 X member rusty X member rusty 19 November 2014 [14:59] 19/11/2014 19 November 2014 [11:43] 19/11/2014 406173824328 406173824328 776453024332 776453024332

ALL 710 CBK ADVISORIES [5]

ALL ADVISORIES, ORDERED by OCCURRENCE DURING 710 CBK's MOT HISTORY
ALL 710 CBK ADVISORIES [5]
ALL ADVISORIES, ORDERED by OCCURRENCE DURING 710 CBK's MOT HISTORY
Advisory Faults | source www.vehiclestats.co.uk
Fault Fault Test Date Test Date/Time Reference MOT Test Reference
2 Nearside rear shock absorber has a slightly worn linkage (2.7.4) Nearside rear shock absorber has a slightly worn linkage (2.7.4) 19 November 2014 [14:59] 19/11/2014 19 November 2014 [11:43] 19/11/2014 406173824328 406173824328 776453024332 776453024332
2 Offside rear shock absorber has a slightly worn bush (2.7.4) Offside rear shock absorber has a slightly worn bush (2.7.4) 19 November 2014 [14:59] 19/11/2014 19 November 2014 [11:43] 19/11/2014 406173824328 406173824328 776453024332 776453024332
1 Offside rear tyre worn close to the legal limit (4.1.e.1) Offside rear tyre worn close to the legal limit (4.1.e.1) 19 November 2013 [15:05] 19/11/2013 799253423321 799253423321

ALL 710 CBK Failure Faults [11]

ALL Failure faults, ORDERED by OCCURRENCE DURING 710 CBK's MOT HISTORY
ALL 710 CBK Failure Faults [11]
ALL Failure faults, ORDERED by OCCURRENCE DURING 710 CBK's MOT HISTORY
Fail Faults | source www.vehiclestats.co.uk
Fault Fault Test Date Test Date/Time Reference MOT Test Reference
1 Offside front position lamp(s) not working (1.1.a.3b) Offside front position lamp(s) not working (1.1.a.3b) 19 November 2014 [11:43] 19/11/2014 776453024332 776453024332
1 Nearside headlamp not working on dipped beam (1.7.5a) Nearside headlamp not working on dipped beam (1.7.5a) 19 November 2014 [11:43] 19/11/2014 776453024332 776453024332
1 Offside front direction indicator not working (1.4.a.2c) Offside front direction indicator not working (1.4.a.2c) 19 November 2014 [11:43] 19/11/2014 776453024332 776453024332
1 Nearside rear leaf spring has a deteriorated shackle pin rubber bush resulting in excessive movement (2.4.b.2) Nearside rear leaf spring has a deteriorated shackle pin rubber bush resulting in excessive movement (2.4.b.2) 19 November 2014 [11:43] 19/11/2014 776453024332 776453024332
1 Offside registration plate lamp not working (1.1.c.1d) Offside registration plate lamp not working (1.1.c.1d) 19 November 2012 [12:20] 19/11/2012 476544022444 476544022444
1 Nearside rear direction indicator not working (1.4.a.2c) Nearside rear direction indicator not working (1.4.a.2c) 19 November 2012 [12:20] 19/11/2012 476544022444 476544022444
1 Nearside front intermediate drop arm insecure (2.2.b.1a) Nearside front intermediate drop arm insecure (2.2.b.1a) 19 November 2012 [12:20] 19/11/2012 476544022444 476544022444
1 Nearside track rod end ball joint has excessive play (2.2.b.1f) Nearside track rod end ball joint has excessive play (2.2.b.1f) 22 November 2011 [15:41] 22/11/2011 486606921349 486606921349
1 Offside track rod end ball joint has excessive play (2.2.b.1f) Offside track rod end ball joint has excessive play (2.2.b.1f) 22 November 2011 [15:41] 22/11/2011 486606921349 486606921349
1 Windscreen washer provides insufficient washer liquid (8.2.3) Windscreen washer provides insufficient washer liquid (8.2.3) 17 November 2010 [15:14] 17/11/2010 660761820356 660761820356
1 Front lower axle swivel joint has excessive play in a swivel pin (2.5.a.3b) Front lower axle swivel joint has excessive play in a swivel pin (2.5.a.3b) 17 November 2010 [15:14] 17/11/2010 660761820356 660761820356

ALL 710 CBK User Entered Faults [2]

ALL User Entered faults, ORDERED by OCCURRENCE DURING 710 CBK's MOT HISTORY
ALL 710 CBK User Entered Faults [2]
ALL User Entered faults, ORDERED by OCCURRENCE DURING 710 CBK's MOT HISTORY
Advisory Faults | source www.vehiclestats.co.uk
Fault Fault Test Date Test Date/Time Reference MOT Test Reference
2 X member rusty X member rusty 19 November 2014 [14:59] 19/11/2014 19 November 2014 [11:43] 19/11/2014 406173824328 406173824328 776453024332 776453024332

MOT TEST: 19 November 2014 14:59:23 PASSED
MOT TEST: 19 November 2014 14:59:23 PASSED

This test (406173824328) was completed on the 19 November 2014 14:59:23 and PASSED the requirements for a valid MOT with 3 comments.

This test (406173824328) was completed on the 19 November 2014 14:59:23 and PASSED the requirements for a valid MOT with 3 comments.

Recorded mileage: 16,620

Recorded mileage: 16,620


ADVISORY

USER ENTERED


MOT TEST: 19 November 2014 11:43:15 FAILED
MOT TEST: 19 November 2014 11:43:15 FAILED

This test (776453024332) was completed on the 19 November 2014 11:43:15 and FAILED the requirements for a valid MOT with 7 comments.

This test (776453024332) was completed on the 19 November 2014 11:43:15 and FAILED the requirements for a valid MOT with 7 comments.

Recorded mileage: 16,619

Recorded mileage: 16,619


ADVISORY

FAIL

USER ENTERED


MOT TEST: 19 November 2013 15:05:14 PASSED
MOT TEST: 19 November 2013 15:05:14 PASSED

This test (799253423321) was completed on the 19 November 2013 15:05:14 and PASSED the requirements for a valid MOT with 1 comments.

This test (799253423321) was completed on the 19 November 2013 15:05:14 and PASSED the requirements for a valid MOT with 1 comments.

Recorded mileage: 16,351

Recorded mileage: 16,351


ADVISORY


MOT TEST: 19 November 2012 14:20:41 PASSED
MOT TEST: 19 November 2012 14:20:41 PASSED

This test (277904622326) was completed on the 19 November 2012 14:20:41 and PASSED the requirements for a valid MOT with 0 comments.

This test (277904622326) was completed on the 19 November 2012 14:20:41 and PASSED the requirements for a valid MOT with 0 comments.

Recorded mileage: 15,535

Recorded mileage: 15,535


MOT TEST: 19 November 2012 12:20:46 FAILED
MOT TEST: 19 November 2012 12:20:46 FAILED

This test (476544022444) was completed on the 19 November 2012 12:20:46 and FAILED the requirements for a valid MOT with 3 comments.

This test (476544022444) was completed on the 19 November 2012 12:20:46 and FAILED the requirements for a valid MOT with 3 comments.

Recorded mileage: 15,534

Recorded mileage: 15,534


FAIL


MOT TEST: 23 November 2011 14:21:24 PASSED
MOT TEST: 23 November 2011 14:21:24 PASSED

This test (657907121370) was completed on the 23 November 2011 14:21:24 and PASSED the requirements for a valid MOT with 0 comments.

This test (657907121370) was completed on the 23 November 2011 14:21:24 and PASSED the requirements for a valid MOT with 0 comments.

Recorded mileage: 15,232

Recorded mileage: 15,232


MOT TEST: 22 November 2011 15:41:14 FAILED
MOT TEST: 22 November 2011 15:41:14 FAILED

This test (486606921349) was completed on the 22 November 2011 15:41:14 and FAILED the requirements for a valid MOT with 2 comments.

This test (486606921349) was completed on the 22 November 2011 15:41:14 and FAILED the requirements for a valid MOT with 2 comments.

Recorded mileage: 15,231

Recorded mileage: 15,231


FAIL


MOT TEST: 23 November 2010 15:14:21 PASSED
MOT TEST: 23 November 2010 15:14:21 PASSED

This test (363537920374) was completed on the 23 November 2010 15:14:21 and PASSED the requirements for a valid MOT with 0 comments.

This test (363537920374) was completed on the 23 November 2010 15:14:21 and PASSED the requirements for a valid MOT with 0 comments.

Recorded mileage: 14,579

Recorded mileage: 14,579


MOT TEST: 17 November 2010 15:14:48 FAILED
MOT TEST: 17 November 2010 15:14:48 FAILED

This test (660761820356) was completed on the 17 November 2010 15:14:48 and FAILED the requirements for a valid MOT with 2 comments.

This test (660761820356) was completed on the 17 November 2010 15:14:48 and FAILED the requirements for a valid MOT with 2 comments.

Recorded mileage: 14,578

Recorded mileage: 14,578


FAIL