711 NTX


711NTX is registered to a Grey 1962, Morris Minor 1000 with a Petrol engine. It Failed its most recent MOT Test on the 12 October 2017

41 unique faults (46 Total) reported in its MOT History (13 Tests).

5 common/recurring faults, the most frequent (2 times) is: Offside door has been taped up on outside covering sharp edge's.

62% (8) MOT Pass Rate and a 38% (5) MOT Failure Rate.

22,789 recorded miles.

711 NTX


711NTX is registered to a Grey 1962, Morris Minor 1000 with a Petrol engine. It Failed its most recent MOT Test on the 12 October 2017

41 unique faults (46 Total) reported in its MOT History (13 Tests).

5 common/recurring faults, the most frequent (2 times) is: Offside door has been taped up on outside covering sharp edge's.

62% (8) MOT Pass Rate and a 38% (5) MOT Failure Rate.

22,789 recorded miles.

MOT PASS/Failure rate for 711 NTX

all MOT test results for 711 NTX represented as a percentage
MOT PASS/Failure rate for 711 NTX
all MOT test results for 711 NTX represented as a percentage

PERCENTAGE OF VEHICLE FAULTS WITH 711 NTX

ALL REPORTED FAULTS, DISPLAYED BY PERCENTAGE OF OCCURRENCE DURING ALL MOT TESTS
PERCENTAGE OF VEHICLE FAULTS WITH 711 NTX
ALL REPORTED FAULTS, DISPLAYED BY PERCENTAGE OF OCCURRENCE DURING ALL MOT TESTS
ADVISORY

FAIL

USER ENTERED

711 NTX annual Faults by type

ALL REPORTED FAULTS, DISPLAYED over time and categorised by type
711 NTX annual Faults by type
ALL REPORTED FAULTS, DISPLAYED over time and categorised by type

RECURRING FAULTS WITH 711 NTX

FAULTS THAT HAVE OCCURED MORE THAN ONCE DURING 711 NTX's MOT HISTORY
RECURRING FAULTS WITH 711 NTX
FAULTS THAT HAVE OCCURED MORE THAN ONCE DURING 711 NTX's MOT HISTORY
Fault Fault Test Date Test Date/Time Reference MOT Test Reference
2 Offside door has been taped up on outside covering sharp edge's Offside door has been taped up on outside covering sharp edge's 12 October 2017 [12:56] 12/10/2017 11 October 2017 [10:56] 11/10/2017 790814820869 790814820869 207573942768 207573942768
2 Nearside door difficult to open from outside Nearside door difficult to open from outside 12 October 2017 [12:56] 12/10/2017 11 October 2017 [10:56] 11/10/2017 790814820869 790814820869 207573942768 207573942768
2 Nearside seat missing Nearside seat missing 12 October 2017 [12:56] 12/10/2017 11 October 2017 [10:56] 11/10/2017 790814820869 790814820869 207573942768 207573942768
2 Front valance corroded Front valance corroded 12 October 2017 [12:56] 12/10/2017 11 October 2017 [10:56] 11/10/2017 790814820869 790814820869 207573942768 207573942768
2 Both front brakes slightly binding Both front brakes slightly binding 12 October 2017 [12:56] 12/10/2017 11 October 2017 [10:56] 11/10/2017 790814820869 790814820869 207573942768 207573942768

ALL 711 NTX ADVISORIES [18]

ALL ADVISORIES, ORDERED by OCCURRENCE DURING 711 NTX's MOT HISTORY
ALL 711 NTX ADVISORIES [18]
ALL ADVISORIES, ORDERED by OCCURRENCE DURING 711 NTX's MOT HISTORY
Advisory Faults | source www.vehiclestats.co.uk
Fault Fault Test Date Test Date/Time Reference MOT Test Reference
2 Offside door has been taped up on outside covering sharp edge's Offside door has been taped up on outside covering sharp edge's 12 October 2017 [12:56] 12/10/2017 11 October 2017 [10:56] 11/10/2017 790814820869 790814820869 207573942768 207573942768
2 Nearside door difficult to open from outside Nearside door difficult to open from outside 12 October 2017 [12:56] 12/10/2017 11 October 2017 [10:56] 11/10/2017 790814820869 790814820869 207573942768 207573942768
2 Nearside seat missing Nearside seat missing 12 October 2017 [12:56] 12/10/2017 11 October 2017 [10:56] 11/10/2017 790814820869 790814820869 207573942768 207573942768
2 Front valance corroded Front valance corroded 12 October 2017 [12:56] 12/10/2017 11 October 2017 [10:56] 11/10/2017 790814820869 790814820869 207573942768 207573942768
2 Both front brakes slightly binding Both front brakes slightly binding 12 October 2017 [12:56] 12/10/2017 11 October 2017 [10:56] 11/10/2017 790814820869 790814820869 207573942768 207573942768
1 Age related corrosion & repairs Age related corrosion & repairs 01 August 2016 [16:01] 01/08/2016 407348906313 407348906313
1 Age related wear to everything Age related wear to everything 01 August 2016 [16:01] 01/08/2016 407348906313 407348906313
1 Engine misfire but no smoke Engine misfire but no smoke 01 August 2016 [16:01] 01/08/2016 407348906313 407348906313
1 Brakes only just met required effort Brakes only just met required effort 01 August 2016 [16:01] 01/08/2016 407348906313 407348906313
1 Offside front front suspension has slight play in a upper suspension ball joint (2.5.b.1a) Offside front front suspension has slight play in a upper suspension ball joint (2.5.b.1a) 03 April 2012 [13:13] 03/04/2012 126084192414 126084192414
1 Nearside front front suspension has slight play in a upper suspension ball joint (2.5.b.1a) Nearside front front suspension has slight play in a upper suspension ball joint (2.5.b.1a) 03 April 2012 [13:13] 03/04/2012 126084192414 126084192414
1 Steering column top bearing slightly worn (2.1.2c) Steering column top bearing slightly worn (2.1.2c) 28 August 2007 [10:48] 28/08/2007 280640447258 280640447258
1 Rear shock absorber has a slightly worn shock absorber pivot (2.7.4) Rear shock absorber has a slightly worn shock absorber pivot (2.7.4) 28 August 2007 [10:48] 28/08/2007 280640447258 280640447258

ALL 711 NTX Failure Faults [23]

ALL Failure faults, ORDERED by OCCURRENCE DURING 711 NTX's MOT HISTORY
ALL 711 NTX Failure Faults [23]
ALL Failure faults, ORDERED by OCCURRENCE DURING 711 NTX's MOT HISTORY
Advisory Faults | source www.vehiclestats.co.uk
Fault Fault Test Date Test Date/Time Reference MOT Test Reference
1 Registration plate lamp not working (1.1.c.1d) Registration plate lamp not working (1.1.c.1d) 11 October 2017 [10:56] 11/10/2017 207573942768 207573942768
1 Indicator tell tale inoperative (1.4.a.2a) Indicator tell tale inoperative (1.4.a.2a) 11 October 2017 [10:56] 11/10/2017 207573942768 207573942768
1 Front sub-frame corroded and seriously weakened subframe at offside front (2.4.g.1) Front sub-frame corroded and seriously weakened subframe at offside front (2.4.g.1) 11 October 2017 [10:56] 11/10/2017 207573942768 207573942768
1 Nearside windscreen wiper does not clear the windscreen effectively split (8.2.2) Nearside windscreen wiper does not clear the windscreen effectively split (8.2.2) 11 October 2017 [10:56] 11/10/2017 207573942768 207573942768
1 Nearside front braking system leaking at wheel cylinder (3.6.a.1) Nearside front braking system leaking at wheel cylinder (3.6.a.1) 11 October 2017 [10:56] 11/10/2017 207573942768 207573942768
1 Nearside rear braking system leaking at bleed nipple (3.6.a.1) Nearside rear braking system leaking at bleed nipple (3.6.a.1) 11 October 2017 [10:56] 11/10/2017 207573942768 207573942768
1 Offside steering locking device missing track rod end ball joint split pin missing (2.2.c.1g) Offside steering locking device missing track rod end ball joint split pin missing (2.2.c.1g) 11 October 2017 [10:56] 11/10/2017 207573942768 207573942768
1 Rear tyre has had the tread recut (4.1.d.1c) Rear tyre has had the tread recut (4.1.d.1c) 08 July 2016 [11:30] 08/07/2016 799401276591 799401276591
1 Rear tyre tread depth below requirements of 1.6mm (4.1.e.1) Rear tyre tread depth below requirements of 1.6mm (4.1.e.1) 08 July 2016 [11:30] 08/07/2016 799401276591 799401276591
1 Nearside rear shock absorber has a serious fluid leak (2.7.3) Nearside rear shock absorber has a serious fluid leak (2.7.3) 08 July 2016 [11:30] 08/07/2016 799401276591 799401276591
1 Offside front tyre tread depth below requirements of 1.6mm (4.1.e.1) Offside front tyre tread depth below requirements of 1.6mm (4.1.e.1) 08 July 2016 [11:30] 08/07/2016 799401276591 799401276591
1 Suspension component mounting prescribed area is excessively corroded inner & outer sills floor inner wing corroded and holed (2.4.a.3) Suspension component mounting prescribed area is excessively corroded inner & outer sills floor inner wing corroded and holed (2.4.a.3) 08 July 2016 [11:30] 08/07/2016 799401276591 799401276591
1 Parking brake: efficiency below requirements (3.7.b.7) Parking brake: efficiency below requirements (3.7.b.7) 08 July 2016 [11:30] 08/07/2016 799401276591 799401276591
1 Front brakes imbalanced across an axle (3.7.b.5b) Front brakes imbalanced across an axle (3.7.b.5b) 08 July 2016 [11:30] 08/07/2016 799401276591 799401276591
1 Rear brakes imbalanced across an axle axle 2 (3.7.b.5b) Rear brakes imbalanced across an axle axle 2 (3.7.b.5b) 08 July 2016 [11:30] 08/07/2016 799401276591 799401276591
1 Offside front tyre has a cut in excess of the requirements deep enough to reach the ply or cords (4.1.d.1a) Offside front tyre has a cut in excess of the requirements deep enough to reach the ply or cords (4.1.d.1a) 19 March 2015 [14:44] 19/03/2015 238508975032 238508975032
1 Nearside front suspension component mounting prescribed area is excessively corroded (2.4.a.3) Nearside front suspension component mounting prescribed area is excessively corroded (2.4.a.3) 19 March 2015 [14:44] 19/03/2015 238508975032 238508975032
1 Offside seat belt anchorage prescribed area is excessively corroded (5.2.6) Offside seat belt anchorage prescribed area is excessively corroded (5.2.6) 19 March 2015 [14:44] 19/03/2015 238508975032 238508975032
1 Vehicle structure has excessive corrosion, seriously affecting its strength within 30cm of the body mountings (6.1.b.2) Vehicle structure has excessive corrosion, seriously affecting its strength within 30cm of the body mountings (6.1.b.2) 19 March 2015 [14:44] 19/03/2015 238508975032 238508975032
1 Brake pedal spongy (3.3.b.1b) Brake pedal spongy (3.3.b.1b) 19 March 2015 [14:44] 19/03/2015 238508975032 238508975032
1 Front passenger door cannot be opened from outside the vehicle (6.2.b.1b) Front passenger door cannot be opened from outside the vehicle (6.2.b.1b) 19 March 2015 [14:44] 19/03/2015 238508975032 238508975032
1 Braking system leaking (3.6.a.1) Braking system leaking (3.6.a.1) 26 August 2009 [10:32] 26/08/2009 301878239229 301878239229
1 Front brake application uneven (3.7.b.2) Front brake application uneven (3.7.b.2) 28 August 2007 [10:48] 28/08/2007 280640447258 280640447258

ALL 711 NTX User Entered Faults [5]

ALL User Entered faults, ORDERED by OCCURRENCE DURING 711 NTX's MOT HISTORY
ALL 711 NTX User Entered Faults [5]
ALL User Entered faults, ORDERED by OCCURRENCE DURING 711 NTX's MOT HISTORY
Fail Faults | source www.vehiclestats.co.uk
Fault Fault Test Date Test Date/Time Reference MOT Test Reference
1 Tyres starting to split inside tread Tyres starting to split inside tread 19 March 2015 [14:44] 19/03/2015 238508975032 238508975032
1 Under car has been under sealed/has also been repaired Under car has been under sealed/has also been repaired 19 March 2015 [14:44] 19/03/2015 238508975032 238508975032
1 General underbody corrosion General underbody corrosion 03 April 2012 [13:13] 03/04/2012 126084192414 126084192414
1 Rear crossmember slight corrosion Rear crossmember slight corrosion 28 August 2007 [10:48] 28/08/2007 280640447258 280640447258
1 O/s rear tyre close to limits O/s rear tyre close to limits 28 August 2007 [10:48] 28/08/2007 280640447258 280640447258

MOT TEST: 12 October 2017 12:56:04 PASSED
MOT TEST: 12 October 2017 12:56:04 PASSED

This test (790814820869) was completed on the 12 October 2017 12:56:04 and PASSED the requirements for a valid MOT with 5 comments.

This test (790814820869) was completed on the 12 October 2017 12:56:04 and PASSED the requirements for a valid MOT with 5 comments.

Recorded mileage: 22,789

Recorded mileage: 22,789


ADVISORY


MOT TEST: 11 October 2017 10:56:43 FAILED
MOT TEST: 11 October 2017 10:56:43 FAILED

This test (207573942768) was completed on the 11 October 2017 10:56:43 and FAILED the requirements for a valid MOT with 12 comments.

This test (207573942768) was completed on the 11 October 2017 10:56:43 and FAILED the requirements for a valid MOT with 12 comments.

Recorded mileage: 22,788

Recorded mileage: 22,788


ADVISORY

FAIL


MOT TEST: 01 August 2016 16:01:01 PASSED
MOT TEST: 01 August 2016 16:01:01 PASSED

This test (407348906313) was completed on the 01 August 2016 16:01:01 and PASSED the requirements for a valid MOT with 4 comments.

This test (407348906313) was completed on the 01 August 2016 16:01:01 and PASSED the requirements for a valid MOT with 4 comments.

Recorded mileage: 22,780

Recorded mileage: 22,780


ADVISORY


MOT TEST: 08 July 2016 11:30:42 FAILED
MOT TEST: 08 July 2016 11:30:42 FAILED

This test (799401276591) was completed on the 08 July 2016 11:30:42 and FAILED the requirements for a valid MOT with 8 comments.

This test (799401276591) was completed on the 08 July 2016 11:30:42 and FAILED the requirements for a valid MOT with 8 comments.

Recorded mileage: 22,776

Recorded mileage: 22,776


FAIL


MOT TEST: 19 March 2015 14:44:13 FAILED
MOT TEST: 19 March 2015 14:44:13 FAILED

This test (238508975032) was completed on the 19 March 2015 14:44:13 and FAILED the requirements for a valid MOT with 8 comments.

This test (238508975032) was completed on the 19 March 2015 14:44:13 and FAILED the requirements for a valid MOT with 8 comments.

Recorded mileage: 22,775

Recorded mileage: 22,775


FAIL

USER ENTERED


MOT TEST: 22 May 2013 11:52:42 PASSED
MOT TEST: 22 May 2013 11:52:42 PASSED

This test (628682543169) was completed on the 22 May 2013 11:52:42 and PASSED the requirements for a valid MOT with 0 comments.

This test (628682543169) was completed on the 22 May 2013 11:52:42 and PASSED the requirements for a valid MOT with 0 comments.

Recorded mileage: 22,714

Recorded mileage: 22,714


MOT TEST: 03 April 2012 13:13:41 PASSED
MOT TEST: 03 April 2012 13:13:41 PASSED

This test (126084192414) was completed on the 03 April 2012 13:13:41 and PASSED the requirements for a valid MOT with 3 comments.

This test (126084192414) was completed on the 03 April 2012 13:13:41 and PASSED the requirements for a valid MOT with 3 comments.

Recorded mileage: 22,057

Recorded mileage: 22,057


ADVISORY

USER ENTERED


MOT TEST: 28 August 2009 11:21:31 PASSED
MOT TEST: 28 August 2009 11:21:31 PASSED

This test (410130449226) was completed on the 28 August 2009 11:21:31 and PASSED the requirements for a valid MOT with 0 comments.

This test (410130449226) was completed on the 28 August 2009 11:21:31 and PASSED the requirements for a valid MOT with 0 comments.

Recorded mileage: 21,965

Recorded mileage: 21,965


MOT TEST: 26 August 2009 10:32:17 FAILED
MOT TEST: 26 August 2009 10:32:17 FAILED

This test (301878239229) was completed on the 26 August 2009 10:32:17 and FAILED the requirements for a valid MOT with 1 comments.

This test (301878239229) was completed on the 26 August 2009 10:32:17 and FAILED the requirements for a valid MOT with 1 comments.

Recorded mileage: 21,963

Recorded mileage: 21,963


FAIL


MOT TEST: 20 August 2008 10:41:22 PASSED
MOT TEST: 20 August 2008 10:41:22 PASSED

This test (504963038220) was completed on the 20 August 2008 10:41:22 and PASSED the requirements for a valid MOT with 0 comments.

This test (504963038220) was completed on the 20 August 2008 10:41:22 and PASSED the requirements for a valid MOT with 0 comments.

Recorded mileage: 21,550

Recorded mileage: 21,550


MOT TEST: 30 August 2007 12:39:38 PASSED
MOT TEST: 30 August 2007 12:39:38 PASSED

This test (324572747447) was completed on the 30 August 2007 12:39:38 and PASSED the requirements for a valid MOT with 0 comments.

This test (324572747447) was completed on the 30 August 2007 12:39:38 and PASSED the requirements for a valid MOT with 0 comments.

Recorded mileage: 20,966

Recorded mileage: 20,966


MOT TEST: 28 August 2007 10:48:02 FAILED
MOT TEST: 28 August 2007 10:48:02 FAILED

This test (280640447258) was completed on the 28 August 2007 10:48:02 and FAILED the requirements for a valid MOT with 5 comments.

This test (280640447258) was completed on the 28 August 2007 10:48:02 and FAILED the requirements for a valid MOT with 5 comments.

Recorded mileage: 20,965

Recorded mileage: 20,965


ADVISORY

FAIL

USER ENTERED


MOT TEST: 30 August 2006 14:56:41 PASSED
MOT TEST: 30 August 2006 14:56:41 PASSED

This test (833702546219) was completed on the 30 August 2006 14:56:41 and PASSED the requirements for a valid MOT with 0 comments.

This test (833702546219) was completed on the 30 August 2006 14:56:41 and PASSED the requirements for a valid MOT with 0 comments.

Recorded mileage: 17,345

Recorded mileage: 17,345