711 XHT


711XHT is registered to a Black 1964, Morris Travler with a Petrol engine. It Failed its most recent MOT Test on the 16 September 2017

8 unique faults (9 Total) reported in its MOT History (10 Tests).

1 common/recurring faults.

60% (6) MOT Pass Rate and a 40% (4) MOT Failure Rate.

31,987 recorded miles.

711 XHT


711XHT is registered to a Black 1964, Morris Travler with a Petrol engine. It Failed its most recent MOT Test on the 16 September 2017

8 unique faults (9 Total) reported in its MOT History (10 Tests).

1 common/recurring faults.

60% (6) MOT Pass Rate and a 40% (4) MOT Failure Rate.

31,987 recorded miles.

MOT PASS/Failure rate for 711 XHT

all MOT test results for 711 XHT represented as a percentage
MOT PASS/Failure rate for 711 XHT
all MOT test results for 711 XHT represented as a percentage

PERCENTAGE OF VEHICLE FAULTS WITH 711 XHT

ALL REPORTED FAULTS, DISPLAYED BY PERCENTAGE OF OCCURRENCE DURING ALL MOT TESTS
PERCENTAGE OF VEHICLE FAULTS WITH 711 XHT
ALL REPORTED FAULTS, DISPLAYED BY PERCENTAGE OF OCCURRENCE DURING ALL MOT TESTS
ADVISORY

FAIL

PASS WITH RECTIFICATION

711 XHT annual Faults by type

ALL REPORTED FAULTS, DISPLAYED over time and categorised by type
711 XHT annual Faults by type
ALL REPORTED FAULTS, DISPLAYED over time and categorised by type

ALL 711 XHT ADVISORIES [3]

ALL ADVISORIES, ORDERED by OCCURRENCE DURING 711 XHT's MOT HISTORY
ALL 711 XHT ADVISORIES [3]
ALL ADVISORIES, ORDERED by OCCURRENCE DURING 711 XHT's MOT HISTORY
Fail Faults | source www.vehiclestats.co.uk
Fault Fault Test Date Test Date/Time Reference MOT Test Reference
1 Oil leak engine oil () Oil leak engine oil () 16 September 2017 [09:55] 16/09/2017 752853327969 752853327969
1 Rear oil leak differential oil () Rear oil leak differential oil () 16 September 2017 [09:55] 16/09/2017 752853327969 752853327969
1 Nearside front wheel bearing has slight play (2.5.a.3c) Nearside front wheel bearing has slight play (2.5.a.3c) 16 September 2017 [09:55] 16/09/2017 752853327969 752853327969

ALL 711 XHT Failure Faults [5]

ALL Failure faults, ORDERED by OCCURRENCE DURING 711 XHT's MOT HISTORY
ALL 711 XHT Failure Faults [5]
ALL Failure faults, ORDERED by OCCURRENCE DURING 711 XHT's MOT HISTORY
Fail Faults | source www.vehiclestats.co.uk
Fault Fault Test Date Test Date/Time Reference MOT Test Reference
1 Brake hydraulic reservoir fluid level below minimum level (3.6.g.1b) Brake hydraulic reservoir fluid level below minimum level (3.6.g.1b) 16 September 2017 [09:55] 16/09/2017 752853327969 752853327969
1 Headlamp not working on main beam both headlamps (1.7.5a) Headlamp not working on main beam both headlamps (1.7.5a) 16 September 2017 [09:55] 16/09/2017 752853327969 752853327969
1 Front passenger door cannot be opened from outside the vehicle (6.2.b.1b) Front passenger door cannot be opened from outside the vehicle (6.2.b.1b) 16 September 2017 [09:55] 16/09/2017 752853327969 752853327969
1 Nearside rear suspension component mounting prescribed area is fractured (2.4.a.3) Nearside rear suspension component mounting prescribed area is fractured (2.4.a.3) 24 February 2015 [12:14] 24/02/2015 876485955029 876485955029
1 Windscreen washer provides insufficient washer liquid (8.2.3) Windscreen washer provides insufficient washer liquid (8.2.3) 22 February 2013 [11:24] 22/02/2013 218473553071 218473553071

ALL 711 XHT Pass With Rectification Faults [1]

ALL Pass With Rectification faults, ORDERED by OCCURRENCE DURING 711 XHT's MOT HISTORY
ALL 711 XHT Pass With Rectification Faults [1]
ALL Pass With Rectification faults, ORDERED by OCCURRENCE DURING 711 XHT's MOT HISTORY
Pass With Rectification Faults | source www.vehiclestats.co.uk
Fault Fault Test Date Test Date/Time Reference MOT Test Reference
1 Windscreen washer provides insufficient washer liquid (8.2.3) Windscreen washer provides insufficient washer liquid (8.2.3) 09 March 2011 [07:57] 09/03/2011 479748861044 479748861044

MOT TEST: 16 September 2017 09:55:59 FAILED
MOT TEST: 16 September 2017 09:55:59 FAILED

This test (752853327969) was completed on the 16 September 2017 09:55:59 and FAILED the requirements for a valid MOT with 6 comments.

This test (752853327969) was completed on the 16 September 2017 09:55:59 and FAILED the requirements for a valid MOT with 6 comments.

Recorded mileage: 31,987

Recorded mileage: 31,987


ADVISORY

FAIL


MOT TEST: 26 February 2015 12:34:30 PASSED
MOT TEST: 26 February 2015 12:34:30 PASSED

This test (495777555057) was completed on the 26 February 2015 12:34:30 and PASSED the requirements for a valid MOT with 0 comments.

This test (495777555057) was completed on the 26 February 2015 12:34:30 and PASSED the requirements for a valid MOT with 0 comments.

Recorded mileage: 28,265

Recorded mileage: 28,265


MOT TEST: 24 February 2015 12:14:57 FAILED
MOT TEST: 24 February 2015 12:14:57 FAILED

This test (876485955029) was completed on the 24 February 2015 12:14:57 and FAILED the requirements for a valid MOT with 1 comments.

This test (876485955029) was completed on the 24 February 2015 12:14:57 and FAILED the requirements for a valid MOT with 1 comments.

Recorded mileage: 28,193

Recorded mileage: 28,193


FAIL


MOT TEST: 21 February 2014 10:38:04 PASSED
MOT TEST: 21 February 2014 10:38:04 PASSED

This test (178412154432) was completed on the 21 February 2014 10:38:04 and PASSED the requirements for a valid MOT with 0 comments.

This test (178412154432) was completed on the 21 February 2014 10:38:04 and PASSED the requirements for a valid MOT with 0 comments.

Recorded mileage: 22,387

Recorded mileage: 22,387


MOT TEST: 22 February 2013 12:40:18 PASSED
MOT TEST: 22 February 2013 12:40:18 PASSED

This test (689023453039) was completed on the 22 February 2013 12:40:18 and PASSED the requirements for a valid MOT with 0 comments.

This test (689023453039) was completed on the 22 February 2013 12:40:18 and PASSED the requirements for a valid MOT with 0 comments.

Recorded mileage: 17,768

Recorded mileage: 17,768


MOT TEST: 22 February 2013 11:24:42 FAILED
MOT TEST: 22 February 2013 11:24:42 FAILED

This test (218473553071) was completed on the 22 February 2013 11:24:42 and FAILED the requirements for a valid MOT with 1 comments.

This test (218473553071) was completed on the 22 February 2013 11:24:42 and FAILED the requirements for a valid MOT with 1 comments.

Recorded mileage: 17,768

Recorded mileage: 17,768


FAIL


MOT TEST: 05 March 2012 12:00:12 PASSED
MOT TEST: 05 March 2012 12:00:12 PASSED

This test (339815262081) was completed on the 05 March 2012 12:00:12 and PASSED the requirements for a valid MOT with 0 comments.

This test (339815262081) was completed on the 05 March 2012 12:00:12 and PASSED the requirements for a valid MOT with 0 comments.

Recorded mileage: 13,686

Recorded mileage: 13,686


MOT TEST: 09 March 2011 07:57:09 FAILED
MOT TEST: 09 March 2011 07:57:09 FAILED

This test (479748861044) was completed on the 09 March 2011 07:57:09 and FAILED the requirements for a valid MOT with 1 comments.

This test (479748861044) was completed on the 09 March 2011 07:57:09 and FAILED the requirements for a valid MOT with 1 comments.

Recorded mileage: 10,309

Recorded mileage: 10,309


PASS WITH RECTIFICATION


MOT TEST: 09 March 2011 07:57:09 PASSED
MOT TEST: 09 March 2011 07:57:09 PASSED

This test (185618761010) was completed on the 09 March 2011 07:57:09 and PASSED the requirements for a valid MOT with 0 comments.

This test (185618761010) was completed on the 09 March 2011 07:57:09 and PASSED the requirements for a valid MOT with 0 comments.

Recorded mileage: 10,309

Recorded mileage: 10,309


MOT TEST: 20 February 2006 12:54:47 PASSED
MOT TEST: 20 February 2006 12:54:47 PASSED

This test (871071256047) was completed on the 20 February 2006 12:54:47 and PASSED the requirements for a valid MOT with 0 comments.

This test (871071256047) was completed on the 20 February 2006 12:54:47 and PASSED the requirements for a valid MOT with 0 comments.

Recorded mileage: 10,259

Recorded mileage: 10,259