712 AOR


712AOR is registered to a Grey 1960, Morris Minor with a Petrol engine. It Failed its most recent MOT Test on the 16 March 2018

17 unique faults (20 Total) reported in its MOT History (11 Tests).

3 common/recurring faults, the most frequent (2 times) is: corrosion on front wing.

73% (8) MOT Pass Rate and a 27% (3) MOT Failure Rate.

51,191 recorded miles.

712 AOR


712AOR is registered to a Grey 1960, Morris Minor with a Petrol engine. It Failed its most recent MOT Test on the 16 March 2018

17 unique faults (20 Total) reported in its MOT History (11 Tests).

3 common/recurring faults, the most frequent (2 times) is: corrosion on front wing.

73% (8) MOT Pass Rate and a 27% (3) MOT Failure Rate.

51,191 recorded miles.

MOT PASS/Failure rate for 712 AOR

all MOT test results for 712 AOR represented as a percentage
MOT PASS/Failure rate for 712 AOR
all MOT test results for 712 AOR represented as a percentage

PERCENTAGE OF VEHICLE FAULTS WITH 712 AOR

ALL REPORTED FAULTS, DISPLAYED BY PERCENTAGE OF OCCURRENCE DURING ALL MOT TESTS
PERCENTAGE OF VEHICLE FAULTS WITH 712 AOR
ALL REPORTED FAULTS, DISPLAYED BY PERCENTAGE OF OCCURRENCE DURING ALL MOT TESTS
ADVISORY

FAIL

USER ENTERED

712 AOR annual Faults by type

ALL REPORTED FAULTS, DISPLAYED over time and categorised by type
712 AOR annual Faults by type
ALL REPORTED FAULTS, DISPLAYED over time and categorised by type

RECURRING FAULTS WITH 712 AOR

FAULTS THAT HAVE OCCURED MORE THAN ONCE DURING 712 AOR's MOT HISTORY
RECURRING FAULTS WITH 712 AOR
FAULTS THAT HAVE OCCURED MORE THAN ONCE DURING 712 AOR's MOT HISTORY
Fault Fault Test Date Test Date/Time Reference MOT Test Reference
2 Corrosion on front wing Corrosion on front wing 30 April 2014 [12:58] 30/04/2014 16 April 2014 [10:41] 16/04/2014 929810824184 929810824184 645006204100 645006204100
2 Offside rear suspension spring mounting prescribed area is excessively corroded (2.4.a.3) Offside rear suspension spring mounting prescribed area is excessively corroded (2.4.a.3) 23 January 2009 [16:33] 23/01/2009 31 May 2007 [13:16] 31/05/2007 863143129014 863143129014 301761357139 301761357139
2 Offside steering rack gaiter deteriorated (2.2.d.2d) Offside steering rack gaiter deteriorated (2.2.d.2d) 17 July 2007 [16:20] 17/07/2007 31 May 2007 [13:16] 31/05/2007 122688597121 122688597121 301761357139 301761357139

ALL 712 AOR ADVISORIES [2]

ALL ADVISORIES, ORDERED by OCCURRENCE DURING 712 AOR's MOT HISTORY
ALL 712 AOR ADVISORIES [2]
ALL ADVISORIES, ORDERED by OCCURRENCE DURING 712 AOR's MOT HISTORY
Advisory Faults | source www.vehiclestats.co.uk
Fault Fault Test Date Test Date/Time Reference MOT Test Reference
2 Offside steering rack gaiter deteriorated (2.2.d.2d) Offside steering rack gaiter deteriorated (2.2.d.2d) 17 July 2007 [16:20] 17/07/2007 31 May 2007 [13:16] 31/05/2007 122688597121 122688597121 301761357139 301761357139

ALL 712 AOR Failure Faults [10]

ALL Failure faults, ORDERED by OCCURRENCE DURING 712 AOR's MOT HISTORY
ALL 712 AOR Failure Faults [10]
ALL Failure faults, ORDERED by OCCURRENCE DURING 712 AOR's MOT HISTORY
Fail Faults | source www.vehiclestats.co.uk
Fault Fault Test Date Test Date/Time Reference MOT Test Reference
2 Offside rear suspension spring mounting prescribed area is excessively corroded (2.4.a.3) Offside rear suspension spring mounting prescribed area is excessively corroded (2.4.a.3) 23 January 2009 [16:33] 23/01/2009 31 May 2007 [13:16] 31/05/2007 863143129014 863143129014 301761357139 301761357139
1 Nearside rear parking brake recording little or no effort (3.7.b.6a) Nearside rear parking brake recording little or no effort (3.7.b.6a) 16 April 2014 [10:41] 16/04/2014 645006204100 645006204100
1 Parking brake: efficiency below requirements (3.7.b.7) Parking brake: efficiency below requirements (3.7.b.7) 16 April 2014 [10:41] 16/04/2014 645006204100 645006204100
1 Brakes imbalanced across an axle (3.7.b.5b) Brakes imbalanced across an axle (3.7.b.5b) 16 April 2014 [10:41] 16/04/2014 645006204100 645006204100
1 Nearside headlamp aim too low (1.8) Nearside headlamp aim too low (1.8) 23 January 2009 [16:33] 23/01/2009 863143129014 863143129014
1 Nearside windscreen washer provides insufficient washer liquid (8.2.3) Nearside windscreen washer provides insufficient washer liquid (8.2.3) 23 January 2009 [16:33] 23/01/2009 863143129014 863143129014
1 Front tyre tread depth below requirements of 1.6mm (4.1.e.1) Front tyre tread depth below requirements of 1.6mm (4.1.e.1) 23 January 2009 [16:33] 23/01/2009 863143129014 863143129014
1 Indicator tell tale inoperative (1.4.a.2a) Indicator tell tale inoperative (1.4.a.2a) 31 May 2007 [13:16] 31/05/2007 301761357139 301761357139
1 Nearside rear suspension spring mounting prescribed area is excessively corroded (2.4.a.3) Nearside rear suspension spring mounting prescribed area is excessively corroded (2.4.a.3) 31 May 2007 [13:16] 31/05/2007 301761357139 301761357139

ALL 712 AOR User Entered Faults [8]

ALL User Entered faults, ORDERED by OCCURRENCE DURING 712 AOR's MOT HISTORY
ALL 712 AOR User Entered Faults [8]
ALL User Entered faults, ORDERED by OCCURRENCE DURING 712 AOR's MOT HISTORY
User Entered Faults | source www.vehiclestats.co.uk
Fault Fault Test Date Test Date/Time Reference MOT Test Reference
2 Corrosion on front wing Corrosion on front wing 30 April 2014 [12:58] 30/04/2014 16 April 2014 [10:41] 16/04/2014 929810824184 929810824184 645006204100 645006204100
1 Nearside spring u bolts very rusty Nearside spring u bolts very rusty 17 July 2007 [16:20] 17/07/2007 122688597121 122688597121
1 Surface rust to floor pans close to torsion bar mountings Surface rust to floor pans close to torsion bar mountings 17 July 2007 [16:20] 17/07/2007 122688597121 122688597121
1 Slight play in nearside steering rack inner joint Slight play in nearside steering rack inner joint 17 July 2007 [16:20] 17/07/2007 122688597121 122688597121
1 Rear brakes slightly unevenly balanced Rear brakes slightly unevenly balanced 17 July 2007 [16:20] 17/07/2007 122688597121 122688597121
1 Nearside rear spring u bolts very rusty Nearside rear spring u bolts very rusty 31 May 2007 [13:16] 31/05/2007 301761357139 301761357139
1 Surface rust to floor pans close to torsion bar mounting points Surface rust to floor pans close to torsion bar mounting points 31 May 2007 [13:16] 31/05/2007 301761357139 301761357139

MOT TEST: 16 March 2018 09:15:28 PASSED
MOT TEST: 16 March 2018 09:15:28 PASSED

This test (271347308083) was completed on the 16 March 2018 09:15:28 and PASSED the requirements for a valid MOT with 0 comments.

This test (271347308083) was completed on the 16 March 2018 09:15:28 and PASSED the requirements for a valid MOT with 0 comments.

Recorded mileage: 51,191

Recorded mileage: 51,191


MOT TEST: 24 February 2017 11:33:28 PASSED
MOT TEST: 24 February 2017 11:33:28 PASSED

This test (321163247867) was completed on the 24 February 2017 11:33:28 and PASSED the requirements for a valid MOT with 0 comments.

This test (321163247867) was completed on the 24 February 2017 11:33:28 and PASSED the requirements for a valid MOT with 0 comments.

Recorded mileage: 46,428

Recorded mileage: 46,428


MOT TEST: 30 April 2014 12:58:51 PASSED
MOT TEST: 30 April 2014 12:58:51 PASSED

This test (929810824184) was completed on the 30 April 2014 12:58:51 and PASSED the requirements for a valid MOT with 1 comments.

This test (929810824184) was completed on the 30 April 2014 12:58:51 and PASSED the requirements for a valid MOT with 1 comments.

Recorded mileage: 46,093

Recorded mileage: 46,093


USER ENTERED


MOT TEST: 16 April 2014 10:41:48 FAILED
MOT TEST: 16 April 2014 10:41:48 FAILED

This test (645006204100) was completed on the 16 April 2014 10:41:48 and FAILED the requirements for a valid MOT with 4 comments.

This test (645006204100) was completed on the 16 April 2014 10:41:48 and FAILED the requirements for a valid MOT with 4 comments.

Recorded mileage: 46,053

Recorded mileage: 46,053


FAIL

USER ENTERED


MOT TEST: 30 November 2012 14:52:10 PASSED
MOT TEST: 30 November 2012 14:52:10 PASSED

This test (838785632334) was completed on the 30 November 2012 14:52:10 and PASSED the requirements for a valid MOT with 0 comments.

This test (838785632334) was completed on the 30 November 2012 14:52:10 and PASSED the requirements for a valid MOT with 0 comments.

Recorded mileage: 44,952

Recorded mileage: 44,952


MOT TEST: 22 November 2011 14:41:02 PASSED
MOT TEST: 22 November 2011 14:41:02 PASSED

This test (589646221397) was completed on the 22 November 2011 14:41:02 and PASSED the requirements for a valid MOT with 0 comments.

This test (589646221397) was completed on the 22 November 2011 14:41:02 and PASSED the requirements for a valid MOT with 0 comments.

Recorded mileage: 43,559

Recorded mileage: 43,559


MOT TEST: 30 January 2009 11:52:43 PASSED
MOT TEST: 30 January 2009 11:52:43 PASSED

This test (901740339017) was completed on the 30 January 2009 11:52:43 and PASSED the requirements for a valid MOT with 0 comments.

This test (901740339017) was completed on the 30 January 2009 11:52:43 and PASSED the requirements for a valid MOT with 0 comments.

Recorded mileage: 40,766

Recorded mileage: 40,766


MOT TEST: 23 January 2009 16:33:19 FAILED
MOT TEST: 23 January 2009 16:33:19 FAILED

This test (863143129014) was completed on the 23 January 2009 16:33:19 and FAILED the requirements for a valid MOT with 4 comments.

This test (863143129014) was completed on the 23 January 2009 16:33:19 and FAILED the requirements for a valid MOT with 4 comments.

Recorded mileage: 40,665

Recorded mileage: 40,665


FAIL


MOT TEST: 17 July 2007 16:20:15 PASSED
MOT TEST: 17 July 2007 16:20:15 PASSED

This test (122688597121) was completed on the 17 July 2007 16:20:15 and PASSED the requirements for a valid MOT with 5 comments.

This test (122688597121) was completed on the 17 July 2007 16:20:15 and PASSED the requirements for a valid MOT with 5 comments.

Recorded mileage: 34,043

Recorded mileage: 34,043


ADVISORY

USER ENTERED


MOT TEST: 31 May 2007 13:16:37 FAILED
MOT TEST: 31 May 2007 13:16:37 FAILED

This test (301761357139) was completed on the 31 May 2007 13:16:37 and FAILED the requirements for a valid MOT with 6 comments.

This test (301761357139) was completed on the 31 May 2007 13:16:37 and FAILED the requirements for a valid MOT with 6 comments.

Recorded mileage: 34,028

Recorded mileage: 34,028


ADVISORY

FAIL

USER ENTERED


MOT TEST: 06 June 2006 12:16:12 PASSED
MOT TEST: 06 June 2006 12:16:12 PASSED

This test (472237156177) was completed on the 06 June 2006 12:16:12 and PASSED the requirements for a valid MOT with 0 comments.

This test (472237156177) was completed on the 06 June 2006 12:16:12 and PASSED the requirements for a valid MOT with 0 comments.

Recorded mileage: 34,009

Recorded mileage: 34,009