712 JUY


712JUY is registered to a Brown 1963, Morris Minor with a Petrol engine. It Passed its most recent MOT Test on the 25 March 2019

16 unique faults (18 Total) reported in its MOT History (15 Tests).

2 common/recurring faults, the most frequent (2 times) is: Front Vehicle structure has excessive corrosion which adversely affects braking or steering (6.1.A.1).

60% (9) MOT Pass Rate and a 40% (6) MOT Failure Rate.

24,436 recorded miles.

712 JUY


712JUY is registered to a Brown 1963, Morris Minor with a Petrol engine. It Passed its most recent MOT Test on the 25 March 2019

16 unique faults (18 Total) reported in its MOT History (15 Tests).

2 common/recurring faults, the most frequent (2 times) is: Front Vehicle structure has excessive corrosion which adversely affects braking or steering (6.1.A.1).

60% (9) MOT Pass Rate and a 40% (6) MOT Failure Rate.

24,436 recorded miles.

MOT PASS/Failure rate for 712 JUY

all MOT test results for 712 JUY represented as a percentage
MOT PASS/Failure rate for 712 JUY
all MOT test results for 712 JUY represented as a percentage

PERCENTAGE OF VEHICLE FAULTS WITH 712 JUY

ALL REPORTED FAULTS, DISPLAYED BY PERCENTAGE OF OCCURRENCE DURING ALL MOT TESTS
PERCENTAGE OF VEHICLE FAULTS WITH 712 JUY
ALL REPORTED FAULTS, DISPLAYED BY PERCENTAGE OF OCCURRENCE DURING ALL MOT TESTS
ADVISORY

FAIL

PASS WITH RECTIFICATION

712 JUY annual Faults by type

ALL REPORTED FAULTS, DISPLAYED over time and categorised by type
712 JUY annual Faults by type
ALL REPORTED FAULTS, DISPLAYED over time and categorised by type

RECURRING FAULTS WITH 712 JUY

FAULTS THAT HAVE OCCURED MORE THAN ONCE DURING 712 JUY's MOT HISTORY
RECURRING FAULTS WITH 712 JUY
FAULTS THAT HAVE OCCURED MORE THAN ONCE DURING 712 JUY's MOT HISTORY
Fault Fault Test Date Test Date/Time Reference MOT Test Reference
2 Front vehicle structure has excessive corrosion which adversely affects braking or steering (6.1.a.1) Front vehicle structure has excessive corrosion which adversely affects braking or steering (6.1.a.1) 29 August 2008 [10:56] 29/08/2008 04 September 2007 [11:39] 04/09/2007 883132948237 883132948237 510047847277 510047847277
2 Offside front vehicle structure has excessive corrosion which adversely affects braking or steering (6.1.a.1) Offside front vehicle structure has excessive corrosion which adversely affects braking or steering (6.1.a.1) 29 August 2008 [10:56] 29/08/2008 10 August 2006 [11:22] 10/08/2006 883132948237 883132948237 292232526270 292232526270

ALL 712 JUY ADVISORIES [2]

ALL ADVISORIES, ORDERED by OCCURRENCE DURING 712 JUY's MOT HISTORY
ALL 712 JUY ADVISORIES [2]
ALL ADVISORIES, ORDERED by OCCURRENCE DURING 712 JUY's MOT HISTORY
Advisory Faults | source www.vehiclestats.co.uk
Fault Fault Test Date Test Date/Time Reference MOT Test Reference
1 Nearside rear service brake binding but not excessively (1.2.1 (f)) Nearside rear service brake binding but not excessively (1.2.1 (f)) 08 March 2019 [12:48] 08/03/2019 744001543615 744001543615
1 Nearside rear tyre slightly damaged/cracking or perishing (5.2.3 (d) (ii)) Nearside rear tyre slightly damaged/cracking or perishing (5.2.3 (d) (ii)) 08 March 2019 [12:48] 08/03/2019 744001543615 744001543615

ALL 712 JUY Failure Faults [15]

ALL Failure faults, ORDERED by OCCURRENCE DURING 712 JUY's MOT HISTORY
ALL 712 JUY Failure Faults [15]
ALL Failure faults, ORDERED by OCCURRENCE DURING 712 JUY's MOT HISTORY
Fail Faults | source www.vehiclestats.co.uk
Fault Fault Test Date Test Date/Time Reference MOT Test Reference
2 Front vehicle structure has excessive corrosion which adversely affects braking or steering (6.1.a.1) Front vehicle structure has excessive corrosion which adversely affects braking or steering (6.1.a.1) 29 August 2008 [10:56] 29/08/2008 04 September 2007 [11:39] 04/09/2007 883132948237 883132948237 510047847277 510047847277
2 Offside front vehicle structure has excessive corrosion which adversely affects braking or steering (6.1.a.1) Offside front vehicle structure has excessive corrosion which adversely affects braking or steering (6.1.a.1) 29 August 2008 [10:56] 29/08/2008 10 August 2006 [11:22] 10/08/2006 883132948237 883132948237 292232526270 292232526270
1 Nearside front steering rack gaiter missing or no longer prevents the ingress of dirt (2.1.3 (g) (ii)) Nearside front steering rack gaiter missing or no longer prevents the ingress of dirt (2.1.3 (g) (ii)) 08 March 2019 [12:48] 08/03/2019 744001543615 744001543615
1 Offside rear hydraulic brake cylinder leaking hydraulic fluid (1.1.16 (b) (i)) Offside rear hydraulic brake cylinder leaking hydraulic fluid (1.1.16 (b) (i)) 08 March 2019 [12:48] 08/03/2019 744001543615 744001543615
1 Offside front upper suspension arm pin or bush likely to become detached (5.3.4 (a) (ii)) Offside front upper suspension arm pin or bush likely to become detached (5.3.4 (a) (ii)) 08 March 2019 [12:48] 08/03/2019 744001543615 744001543615
1 Front vehicle structure has excessive corrosion, seriously affecting its strength within 30cm of the body mountings (6.1.b.2) Front vehicle structure has excessive corrosion, seriously affecting its strength within 30cm of the body mountings (6.1.b.2) 28 August 2009 [10:47] 28/08/2009 353020349201 353020349201
1 Offside vehicle structure has excessive corrosion which adversely affects braking or steering (6.1.a.1) Offside vehicle structure has excessive corrosion which adversely affects braking or steering (6.1.a.1) 29 August 2008 [10:56] 29/08/2008 883132948237 883132948237
1 Nearside vehicle structure has excessive corrosion which adversely affects braking or steering (6.1.a.1) Nearside vehicle structure has excessive corrosion which adversely affects braking or steering (6.1.a.1) 29 August 2008 [10:56] 29/08/2008 883132948237 883132948237
1 Nearside front suspension has excessive play in a lower suspension ball joint (2.5.b.1a) Nearside front suspension has excessive play in a lower suspension ball joint (2.5.b.1a) 10 August 2006 [11:22] 10/08/2006 292232526270 292232526270
1 Offside front suspension has excessive play in a lower suspension ball joint (2.5.b.1a) Offside front suspension has excessive play in a lower suspension ball joint (2.5.b.1a) 10 August 2006 [11:22] 10/08/2006 292232526270 292232526270
1 Nearside track rod end ball joint has excessive play (2.2.b.1f) Nearside track rod end ball joint has excessive play (2.2.b.1f) 10 August 2006 [11:22] 10/08/2006 292232526270 292232526270
1 Offside rear vehicle structure has excessive corrosion which adversely affects braking or steering (6.1.a.1) Offside rear vehicle structure has excessive corrosion which adversely affects braking or steering (6.1.a.1) 10 August 2006 [11:22] 10/08/2006 292232526270 292232526270
1 Nearside front vehicle structure has excessive corrosion which adversely affects braking or steering (6.1.a.1) Nearside front vehicle structure has excessive corrosion which adversely affects braking or steering (6.1.a.1) 10 August 2006 [11:22] 10/08/2006 292232526270 292232526270

ALL 712 JUY Pass With Rectification Faults [1]

ALL Pass With Rectification faults, ORDERED by OCCURRENCE DURING 712 JUY's MOT HISTORY
ALL 712 JUY Pass With Rectification Faults [1]
ALL Pass With Rectification faults, ORDERED by OCCURRENCE DURING 712 JUY's MOT HISTORY
Pass With Rectification Faults | source www.vehiclestats.co.uk
Fault Fault Test Date Test Date/Time Reference MOT Test Reference
1 Front tyre(s) incorrect because different size tyres are fitted on the same axle. (4.1.a.1a) Front tyre(s) incorrect because different size tyres are fitted on the same axle. (4.1.a.1a) 23 October 2017 [15:05] 23/10/2017 471617596680 471617596680

MOT TEST: 25 March 2019 15:26:09 PASSED
MOT TEST: 25 March 2019 15:26:09 PASSED

This test (139822158472) was completed on the 25 March 2019 15:26:09 and PASSED the requirements for a valid MOT with 0 comments.

This test (139822158472) was completed on the 25 March 2019 15:26:09 and PASSED the requirements for a valid MOT with 0 comments.

Recorded mileage: 24,436

Recorded mileage: 24,436


MOT TEST: 08 March 2019 12:48:00 FAILED
MOT TEST: 08 March 2019 12:48:00 FAILED

This test (744001543615) was completed on the 08 March 2019 12:48:00 and FAILED the requirements for a valid MOT with 5 comments.

This test (744001543615) was completed on the 08 March 2019 12:48:00 and FAILED the requirements for a valid MOT with 5 comments.

Recorded mileage: 24,435

Recorded mileage: 24,435


ADVISORY

FAIL


MOT TEST: 23 October 2017 15:05:17 PASSED
MOT TEST: 23 October 2017 15:05:17 PASSED

This test (279221570173) was completed on the 23 October 2017 15:05:17 and PASSED the requirements for a valid MOT with 0 comments.

This test (279221570173) was completed on the 23 October 2017 15:05:17 and PASSED the requirements for a valid MOT with 0 comments.

Recorded mileage: 22,693

Recorded mileage: 22,693


MOT TEST: 23 October 2017 15:05:16 FAILED
MOT TEST: 23 October 2017 15:05:16 FAILED

This test (471617596680) was completed on the 23 October 2017 15:05:16 and FAILED the requirements for a valid MOT with 1 comments.

This test (471617596680) was completed on the 23 October 2017 15:05:16 and FAILED the requirements for a valid MOT with 1 comments.

Recorded mileage: 22,693

Recorded mileage: 22,693


PASS WITH RECTIFICATION


MOT TEST: 17 May 2016 13:30:40 PASSED
MOT TEST: 17 May 2016 13:30:40 PASSED

This test (899840613280) was completed on the 17 May 2016 13:30:40 and PASSED the requirements for a valid MOT with 0 comments.

This test (899840613280) was completed on the 17 May 2016 13:30:40 and PASSED the requirements for a valid MOT with 0 comments.

Recorded mileage: 19,511

Recorded mileage: 19,511


MOT TEST: 03 June 2015 13:02:52 PASSED
MOT TEST: 03 June 2015 13:02:52 PASSED

This test (277314255130) was completed on the 03 June 2015 13:02:52 and PASSED the requirements for a valid MOT with 0 comments.

This test (277314255130) was completed on the 03 June 2015 13:02:52 and PASSED the requirements for a valid MOT with 0 comments.

Recorded mileage: 16,496

Recorded mileage: 16,496


MOT TEST: 06 May 2014 13:56:51 PASSED
MOT TEST: 06 May 2014 13:56:51 PASSED

This test (659356424174) was completed on the 06 May 2014 13:56:51 and PASSED the requirements for a valid MOT with 0 comments.

This test (659356424174) was completed on the 06 May 2014 13:56:51 and PASSED the requirements for a valid MOT with 0 comments.

Recorded mileage: 12,840

Recorded mileage: 12,840


MOT TEST: 01 September 2009 15:46:16 PASSED
MOT TEST: 01 September 2009 15:46:16 PASSED

This test (921234949218) was completed on the 01 September 2009 15:46:16 and PASSED the requirements for a valid MOT with 0 comments.

This test (921234949218) was completed on the 01 September 2009 15:46:16 and PASSED the requirements for a valid MOT with 0 comments.

Recorded mileage: 11,223

Recorded mileage: 11,223


MOT TEST: 28 August 2009 10:47:12 FAILED
MOT TEST: 28 August 2009 10:47:12 FAILED

This test (353020349201) was completed on the 28 August 2009 10:47:12 and FAILED the requirements for a valid MOT with 1 comments.

This test (353020349201) was completed on the 28 August 2009 10:47:12 and FAILED the requirements for a valid MOT with 1 comments.

Recorded mileage: 11,229

Recorded mileage: 11,229


FAIL


MOT TEST: 29 August 2008 14:00:33 PASSED
MOT TEST: 29 August 2008 14:00:33 PASSED

This test (921532548250) was completed on the 29 August 2008 14:00:33 and PASSED the requirements for a valid MOT with 0 comments.

This test (921532548250) was completed on the 29 August 2008 14:00:33 and PASSED the requirements for a valid MOT with 0 comments.

Recorded mileage: 10,931

Recorded mileage: 10,931


MOT TEST: 29 August 2008 10:56:34 FAILED
MOT TEST: 29 August 2008 10:56:34 FAILED

This test (883132948237) was completed on the 29 August 2008 10:56:34 and FAILED the requirements for a valid MOT with 4 comments.

This test (883132948237) was completed on the 29 August 2008 10:56:34 and FAILED the requirements for a valid MOT with 4 comments.

Recorded mileage: 10,928

Recorded mileage: 10,928


FAIL


MOT TEST: 04 September 2007 14:40:18 PASSED
MOT TEST: 04 September 2007 14:40:18 PASSED

This test (144557147213) was completed on the 04 September 2007 14:40:18 and PASSED the requirements for a valid MOT with 0 comments.

This test (144557147213) was completed on the 04 September 2007 14:40:18 and PASSED the requirements for a valid MOT with 0 comments.

Recorded mileage: 10,368

Recorded mileage: 10,368


MOT TEST: 04 September 2007 11:39:14 FAILED
MOT TEST: 04 September 2007 11:39:14 FAILED

This test (510047847277) was completed on the 04 September 2007 11:39:14 and FAILED the requirements for a valid MOT with 1 comments.

This test (510047847277) was completed on the 04 September 2007 11:39:14 and FAILED the requirements for a valid MOT with 1 comments.

Recorded mileage: 10,366

Recorded mileage: 10,366


FAIL


MOT TEST: 01 September 2006 16:31:14 PASSED
MOT TEST: 01 September 2006 16:31:14 PASSED

This test (931094446233) was completed on the 01 September 2006 16:31:14 and PASSED the requirements for a valid MOT with 0 comments.

This test (931094446233) was completed on the 01 September 2006 16:31:14 and PASSED the requirements for a valid MOT with 0 comments.

Recorded mileage: 9,859

Recorded mileage: 9,859


MOT TEST: 10 August 2006 11:22:57 FAILED
MOT TEST: 10 August 2006 11:22:57 FAILED

This test (292232526270) was completed on the 10 August 2006 11:22:57 and FAILED the requirements for a valid MOT with 6 comments.

This test (292232526270) was completed on the 10 August 2006 11:22:57 and FAILED the requirements for a valid MOT with 6 comments.

Recorded mileage: 9,850

Recorded mileage: 9,850


FAIL