715 VKM


715VKM is registered to a Green 1962, Morris Minor 1000 with a Petrol engine. It Passed its most recent MOT Test on the 26 February 2019

10 unique faults (15 Total) reported in its MOT History (10 Tests).

3 common/recurring faults, the most frequent (3 times) is: Parking brake: efficiency below requirements (3.7.B.7).

60% (6) MOT Pass Rate and a 40% (4) MOT Failure Rate.

5,885 recorded miles.

715 VKM


715VKM is registered to a Green 1962, Morris Minor 1000 with a Petrol engine. It Passed its most recent MOT Test on the 26 February 2019

10 unique faults (15 Total) reported in its MOT History (10 Tests).

3 common/recurring faults, the most frequent (3 times) is: Parking brake: efficiency below requirements (3.7.B.7).

60% (6) MOT Pass Rate and a 40% (4) MOT Failure Rate.

5,885 recorded miles.

MOT PASS/Failure rate for 715 VKM

all MOT test results for 715 VKM represented as a percentage
MOT PASS/Failure rate for 715 VKM
all MOT test results for 715 VKM represented as a percentage

PERCENTAGE OF VEHICLE FAULTS WITH 715 VKM

ALL REPORTED FAULTS, DISPLAYED BY PERCENTAGE OF OCCURRENCE DURING ALL MOT TESTS
PERCENTAGE OF VEHICLE FAULTS WITH 715 VKM
ALL REPORTED FAULTS, DISPLAYED BY PERCENTAGE OF OCCURRENCE DURING ALL MOT TESTS
ADVISORY

FAIL

MINOR

715 VKM annual Faults by type

ALL REPORTED FAULTS, DISPLAYED over time and categorised by type
715 VKM annual Faults by type
ALL REPORTED FAULTS, DISPLAYED over time and categorised by type

RECURRING FAULTS WITH 715 VKM

FAULTS THAT HAVE OCCURED MORE THAN ONCE DURING 715 VKM's MOT HISTORY
RECURRING FAULTS WITH 715 VKM
FAULTS THAT HAVE OCCURED MORE THAN ONCE DURING 715 VKM's MOT HISTORY
Fault Fault Test Date Test Date/Time Reference MOT Test Reference
3 Parking brake: efficiency below requirements (3.7.b.7) Parking brake: efficiency below requirements (3.7.b.7) 02 February 2016 [16:21] 02/02/2016 01 February 2016 [08:49] 01/02/2016 16 January 2015 [09:02] 16/01/2015 227530435816 227530435816 909145714886 909145714886 155016115454 155016115454
3 Brakes imbalanced across an axle (3.7.b.5b) Brakes imbalanced across an axle (3.7.b.5b) 02 February 2016 [16:21] 02/02/2016 01 February 2016 [08:49] 01/02/2016 16 January 2015 [09:02] 16/01/2015 227530435816 227530435816 909145714886 909145714886 155016115454 155016115454
2 Rear brakes imbalanced across an axle axle 2 (3.7.b.5b) Rear brakes imbalanced across an axle axle 2 (3.7.b.5b) 02 February 2016 [16:21] 02/02/2016 01 February 2016 [08:49] 01/02/2016 227530435816 227530435816 909145714886 909145714886

ALL 715 VKM ADVISORIES [2]

ALL ADVISORIES, ORDERED by OCCURRENCE DURING 715 VKM's MOT HISTORY
ALL 715 VKM ADVISORIES [2]
ALL ADVISORIES, ORDERED by OCCURRENCE DURING 715 VKM's MOT HISTORY
Advisory Faults | source www.vehiclestats.co.uk
Fault Fault Test Date Test Date/Time Reference MOT Test Reference
1 Oil leak, but not excessive (8.4.1 (a) (i)) Oil leak, but not excessive (8.4.1 (a) (i)) 26 February 2019 [16:20] 26/02/2019 862237936590 862237936590
1 Oil leak () Oil leak () 24 January 2018 [15:58] 24/01/2018 168951372602 168951372602

ALL 715 VKM Failure Faults [11]

ALL Failure faults, ORDERED by OCCURRENCE DURING 715 VKM's MOT HISTORY
ALL 715 VKM Failure Faults [11]
ALL Failure faults, ORDERED by OCCURRENCE DURING 715 VKM's MOT HISTORY
Fail Faults | source www.vehiclestats.co.uk
Fault Fault Test Date Test Date/Time Reference MOT Test Reference
3 Parking brake: efficiency below requirements (3.7.b.7) Parking brake: efficiency below requirements (3.7.b.7) 02 February 2016 [16:21] 02/02/2016 01 February 2016 [08:49] 01/02/2016 16 January 2015 [09:02] 16/01/2015 227530435816 227530435816 909145714886 909145714886 155016115454 155016115454
3 Brakes imbalanced across an axle (3.7.b.5b) Brakes imbalanced across an axle (3.7.b.5b) 02 February 2016 [16:21] 02/02/2016 01 February 2016 [08:49] 01/02/2016 16 January 2015 [09:02] 16/01/2015 227530435816 227530435816 909145714886 909145714886 155016115454 155016115454
2 Rear brakes imbalanced across an axle axle 2 (3.7.b.5b) Rear brakes imbalanced across an axle axle 2 (3.7.b.5b) 02 February 2016 [16:21] 02/02/2016 01 February 2016 [08:49] 01/02/2016 227530435816 227530435816 909145714886 909145714886
1 Offside rear stop lamp(s) not working (4.3.1 (a) (ii)) Offside rear stop lamp(s) not working (4.3.1 (a) (ii)) 19 February 2019 [17:04] 19/02/2019 585911090235 585911090235
1 Offside front steering rack gaiter missing or no longer prevents the ingress of dirt (2.1.3 (g) (ii)) Offside front steering rack gaiter missing or no longer prevents the ingress of dirt (2.1.3 (g) (ii)) 19 February 2019 [17:04] 19/02/2019 585911090235 585911090235
1 Fuel cap/sealing device sealing washer deteriorated (7.2.4c) Fuel cap/sealing device sealing washer deteriorated (7.2.4c) 01 February 2016 [08:49] 01/02/2016 909145714886 909145714886

ALL 715 VKM minor Faults [2]

ALL minor faults, ORDERED by OCCURRENCE DURING 715 VKM's MOT HISTORY
ALL 715 VKM minor Faults [2]
ALL minor faults, ORDERED by OCCURRENCE DURING 715 VKM's MOT HISTORY
Fail Faults | source www.vehiclestats.co.uk
Fault Fault Test Date Test Date/Time Reference MOT Test Reference
1 Nearside rear registration plate lamp inoperative in the case of multiple lamps or light sources bulb not working (4.7.1 (b) (i)) Nearside rear registration plate lamp inoperative in the case of multiple lamps or light sources bulb not working (4.7.1 (b) (i)) 19 February 2019 [17:04] 19/02/2019 585911090235 585911090235
1 Offside front track rod end ball joint dust cover damaged or deteriorated, but preventing the ingress of dirt slightly loose/insecure (2.1.3 (g) (i)) Offside front track rod end ball joint dust cover damaged or deteriorated, but preventing the ingress of dirt slightly loose/insecure (2.1.3 (g) (i)) 19 February 2019 [17:04] 19/02/2019 585911090235 585911090235

MOT TEST: 26 February 2019 16:20:59 PASSED
MOT TEST: 26 February 2019 16:20:59 PASSED

This test (862237936590) was completed on the 26 February 2019 16:20:59 and PASSED the requirements for a valid MOT with 1 comments.

This test (862237936590) was completed on the 26 February 2019 16:20:59 and PASSED the requirements for a valid MOT with 1 comments.

Recorded mileage: 5,885

Recorded mileage: 5,885


ADVISORY


MOT TEST: 19 February 2019 17:04:41 FAILED
MOT TEST: 19 February 2019 17:04:41 FAILED

This test (585911090235) was completed on the 19 February 2019 17:04:41 and FAILED the requirements for a valid MOT with 4 comments.

This test (585911090235) was completed on the 19 February 2019 17:04:41 and FAILED the requirements for a valid MOT with 4 comments.

Recorded mileage: 5,865

Recorded mileage: 5,865


FAIL

MINOR


MOT TEST: 24 January 2018 15:58:05 PASSED
MOT TEST: 24 January 2018 15:58:05 PASSED

This test (168951372602) was completed on the 24 January 2018 15:58:05 and PASSED the requirements for a valid MOT with 1 comments.

This test (168951372602) was completed on the 24 January 2018 15:58:05 and PASSED the requirements for a valid MOT with 1 comments.

Recorded mileage: 5,218

Recorded mileage: 5,218


ADVISORY


MOT TEST: 23 January 2017 15:54:32 PASSED
MOT TEST: 23 January 2017 15:54:32 PASSED

This test (776712679750) was completed on the 23 January 2017 15:54:32 and PASSED the requirements for a valid MOT with 0 comments.

This test (776712679750) was completed on the 23 January 2017 15:54:32 and PASSED the requirements for a valid MOT with 0 comments.

Recorded mileage: 4,573

Recorded mileage: 4,573


MOT TEST: 08 February 2016 11:51:09 PASSED
MOT TEST: 08 February 2016 11:51:09 PASSED

This test (422478903650) was completed on the 08 February 2016 11:51:09 and PASSED the requirements for a valid MOT with 0 comments.

This test (422478903650) was completed on the 08 February 2016 11:51:09 and PASSED the requirements for a valid MOT with 0 comments.

Recorded mileage: 2,970

Recorded mileage: 2,970


MOT TEST: 02 February 2016 16:21:44 FAILED
MOT TEST: 02 February 2016 16:21:44 FAILED

This test (227530435816) was completed on the 02 February 2016 16:21:44 and FAILED the requirements for a valid MOT with 3 comments.

This test (227530435816) was completed on the 02 February 2016 16:21:44 and FAILED the requirements for a valid MOT with 3 comments.

Recorded mileage: 2,945

Recorded mileage: 2,945


FAIL


MOT TEST: 01 February 2016 08:49:36 FAILED
MOT TEST: 01 February 2016 08:49:36 FAILED

This test (909145714886) was completed on the 01 February 2016 08:49:36 and FAILED the requirements for a valid MOT with 4 comments.

This test (909145714886) was completed on the 01 February 2016 08:49:36 and FAILED the requirements for a valid MOT with 4 comments.

Recorded mileage: 2,921

Recorded mileage: 2,921


FAIL


MOT TEST: 23 January 2015 10:06:24 PASSED
MOT TEST: 23 January 2015 10:06:24 PASSED

This test (427023625061) was completed on the 23 January 2015 10:06:24 and PASSED the requirements for a valid MOT with 0 comments.

This test (427023625061) was completed on the 23 January 2015 10:06:24 and PASSED the requirements for a valid MOT with 0 comments.

Recorded mileage: 2,345

Recorded mileage: 2,345


MOT TEST: 16 January 2015 09:02:16 FAILED
MOT TEST: 16 January 2015 09:02:16 FAILED

This test (155016115454) was completed on the 16 January 2015 09:02:16 and FAILED the requirements for a valid MOT with 2 comments.

This test (155016115454) was completed on the 16 January 2015 09:02:16 and FAILED the requirements for a valid MOT with 2 comments.

Recorded mileage: 2,256

Recorded mileage: 2,256


FAIL


MOT TEST: 31 January 2014 09:04:34 PASSED
MOT TEST: 31 January 2014 09:04:34 PASSED

This test (645711734062) was completed on the 31 January 2014 09:04:34 and PASSED the requirements for a valid MOT with 0 comments.

This test (645711734062) was completed on the 31 January 2014 09:04:34 and PASSED the requirements for a valid MOT with 0 comments.

Recorded mileage: 18

Recorded mileage: 18