716 3AR


7163AR is registered to a Blue 1960, Morris Minor 1000 with a Petrol engine. It Failed its most recent MOT Test on the 24 September 2010

10 unique faults (12 Total) reported in its MOT History (6 Tests).

2 common/recurring faults, the most frequent (2 times) is: Nearside Rear Suspension spring mounting prescribed area is excessively corroded (2.4.A.3).

67% (4) MOT Pass Rate and a 33% (2) MOT Failure Rate.

58,326 recorded miles.

716 3AR


7163AR is registered to a Blue 1960, Morris Minor 1000 with a Petrol engine. It Failed its most recent MOT Test on the 24 September 2010

10 unique faults (12 Total) reported in its MOT History (6 Tests).

2 common/recurring faults, the most frequent (2 times) is: Nearside Rear Suspension spring mounting prescribed area is excessively corroded (2.4.A.3).

67% (4) MOT Pass Rate and a 33% (2) MOT Failure Rate.

58,326 recorded miles.

MOT PASS/Failure rate for 716 3AR

all MOT test results for 716 3AR represented as a percentage
MOT PASS/Failure rate for 716 3AR
all MOT test results for 716 3AR represented as a percentage

PERCENTAGE OF VEHICLE FAULTS WITH 716 3AR

ALL REPORTED FAULTS, DISPLAYED BY PERCENTAGE OF OCCURRENCE DURING ALL MOT TESTS
PERCENTAGE OF VEHICLE FAULTS WITH 716 3AR
ALL REPORTED FAULTS, DISPLAYED BY PERCENTAGE OF OCCURRENCE DURING ALL MOT TESTS
ADVISORY

FAIL

716 3AR annual Faults by type

ALL REPORTED FAULTS, DISPLAYED over time and categorised by type
716 3AR annual Faults by type
ALL REPORTED FAULTS, DISPLAYED over time and categorised by type

RECURRING FAULTS WITH 716 3AR

FAULTS THAT HAVE OCCURED MORE THAN ONCE DURING 716 3AR's MOT HISTORY
RECURRING FAULTS WITH 716 3AR
FAULTS THAT HAVE OCCURED MORE THAN ONCE DURING 716 3AR's MOT HISTORY
Fault Fault Test Date Test Date/Time Reference MOT Test Reference
2 Nearside rear suspension spring mounting prescribed area is excessively corroded (2.4.a.3) Nearside rear suspension spring mounting prescribed area is excessively corroded (2.4.a.3) 16 September 2010 [10:50] 16/09/2010 14 July 2008 [13:25] 14/07/2008 602379050220 602379050220 711256698102 711256698102
2 Offside front suspension has slight play in a lower suspension ball joint (2.5.b.1a) Offside front suspension has slight play in a lower suspension ball joint (2.5.b.1a) 17 July 2008 [14:32] 17/07/2008 14 July 2008 [13:25] 14/07/2008 274949098105 274949098105 711256698102 711256698102

ALL 716 3AR ADVISORIES [2]

ALL ADVISORIES, ORDERED by OCCURRENCE DURING 716 3AR's MOT HISTORY
ALL 716 3AR ADVISORIES [2]
ALL ADVISORIES, ORDERED by OCCURRENCE DURING 716 3AR's MOT HISTORY
Advisory Faults | source www.vehiclestats.co.uk
Fault Fault Test Date Test Date/Time Reference MOT Test Reference
2 Offside front suspension has slight play in a lower suspension ball joint (2.5.b.1a) Offside front suspension has slight play in a lower suspension ball joint (2.5.b.1a) 17 July 2008 [14:32] 17/07/2008 14 July 2008 [13:25] 14/07/2008 274949098105 274949098105 711256698102 711256698102

ALL 716 3AR Failure Faults [10]

ALL Failure faults, ORDERED by OCCURRENCE DURING 716 3AR's MOT HISTORY
ALL 716 3AR Failure Faults [10]
ALL Failure faults, ORDERED by OCCURRENCE DURING 716 3AR's MOT HISTORY
Fail Faults | source www.vehiclestats.co.uk
Fault Fault Test Date Test Date/Time Reference MOT Test Reference
2 Nearside rear suspension spring mounting prescribed area is excessively corroded (2.4.a.3) Nearside rear suspension spring mounting prescribed area is excessively corroded (2.4.a.3) 16 September 2010 [10:50] 16/09/2010 14 July 2008 [13:25] 14/07/2008 602379050220 602379050220 711256698102 711256698102
1 Nearside headlamp not working on dipped beam (1.7.5a) Nearside headlamp not working on dipped beam (1.7.5a) 16 September 2010 [10:50] 16/09/2010 602379050220 602379050220
1 Offside stop lamp not working (1.2.1b) Offside stop lamp not working (1.2.1b) 14 July 2008 [13:25] 14/07/2008 711256698102 711256698102
1 Steering system has excessive free play detected at the steering wheel (steering rack fitted) (2.2.a.1b) Steering system has excessive free play detected at the steering wheel (steering rack fitted) (2.2.a.1b) 14 July 2008 [13:25] 14/07/2008 711256698102 711256698102
1 Nearside steering rack gaiter split (2.2.d.2d) Nearside steering rack gaiter split (2.2.d.2d) 14 July 2008 [13:25] 14/07/2008 711256698102 711256698102
1 Offside rear suspension spring mounting prescribed area is excessively corroded (2.4.a.3) Offside rear suspension spring mounting prescribed area is excessively corroded (2.4.a.3) 14 July 2008 [13:25] 14/07/2008 711256698102 711256698102
1 Nearside front upper suspension component mounting prescribed area is excessively corroded (2.4.a.3) Nearside front upper suspension component mounting prescribed area is excessively corroded (2.4.a.3) 14 July 2008 [13:25] 14/07/2008 711256698102 711256698102
1 Offside rear upper suspension component mounting prescribed area is excessively corroded (2.4.a.3) Offside rear upper suspension component mounting prescribed area is excessively corroded (2.4.a.3) 14 July 2008 [13:25] 14/07/2008 711256698102 711256698102
1 Nearside front suspension has excessive play in a lower suspension ball joint (2.5.b.1a) Nearside front suspension has excessive play in a lower suspension ball joint (2.5.b.1a) 14 July 2008 [13:25] 14/07/2008 711256698102 711256698102

MOT TEST: 24 September 2010 12:14:49 PASSED
MOT TEST: 24 September 2010 12:14:49 PASSED

This test (534417760281) was completed on the 24 September 2010 12:14:49 and PASSED the requirements for a valid MOT with 0 comments.

This test (534417760281) was completed on the 24 September 2010 12:14:49 and PASSED the requirements for a valid MOT with 0 comments.

Recorded mileage: 58,326

Recorded mileage: 58,326


MOT TEST: 16 September 2010 10:50:14 FAILED
MOT TEST: 16 September 2010 10:50:14 FAILED

This test (602379050220) was completed on the 16 September 2010 10:50:14 and FAILED the requirements for a valid MOT with 2 comments.

This test (602379050220) was completed on the 16 September 2010 10:50:14 and FAILED the requirements for a valid MOT with 2 comments.

Recorded mileage: 58,323

Recorded mileage: 58,323


FAIL


MOT TEST: 04 September 2009 16:17:04 PASSED
MOT TEST: 04 September 2009 16:17:04 PASSED

This test (732227149225) was completed on the 04 September 2009 16:17:04 and PASSED the requirements for a valid MOT with 0 comments.

This test (732227149225) was completed on the 04 September 2009 16:17:04 and PASSED the requirements for a valid MOT with 0 comments.

Recorded mileage: 58,286

Recorded mileage: 58,286


MOT TEST: 17 July 2008 14:32:52 PASSED
MOT TEST: 17 July 2008 14:32:52 PASSED

This test (274949098105) was completed on the 17 July 2008 14:32:52 and PASSED the requirements for a valid MOT with 1 comments.

This test (274949098105) was completed on the 17 July 2008 14:32:52 and PASSED the requirements for a valid MOT with 1 comments.

Recorded mileage: 58,061

Recorded mileage: 58,061


ADVISORY


MOT TEST: 14 July 2008 13:25:03 FAILED
MOT TEST: 14 July 2008 13:25:03 FAILED

This test (711256698102) was completed on the 14 July 2008 13:25:03 and FAILED the requirements for a valid MOT with 9 comments.

This test (711256698102) was completed on the 14 July 2008 13:25:03 and FAILED the requirements for a valid MOT with 9 comments.

Recorded mileage: 58,050

Recorded mileage: 58,050


ADVISORY

FAIL


MOT TEST: 10 January 2006 15:30:22 PASSED
MOT TEST: 10 January 2006 15:30:22 PASSED

This test (153760016454) was completed on the 10 January 2006 15:30:22 and PASSED the requirements for a valid MOT with 0 comments.

This test (153760016454) was completed on the 10 January 2006 15:30:22 and PASSED the requirements for a valid MOT with 0 comments.

Recorded mileage: 57,198

Recorded mileage: 57,198