717 AVE


717AVE is registered to a Black 1962, Morris Oxford with a Petrol engine. It Failed its most recent MOT Test on the 06 July 2017

21 unique faults (25 Total) reported in its MOT History (18 Tests).

2 common/recurring faults, the most frequent (2 times) is: under body genraly weak in places ..

67% (12) MOT Pass Rate and a 33% (6) MOT Failure Rate.

76,371 recorded miles.

717 AVE


717AVE is registered to a Black 1962, Morris Oxford with a Petrol engine. It Failed its most recent MOT Test on the 06 July 2017

21 unique faults (25 Total) reported in its MOT History (18 Tests).

2 common/recurring faults, the most frequent (2 times) is: under body genraly weak in places ..

67% (12) MOT Pass Rate and a 33% (6) MOT Failure Rate.

76,371 recorded miles.

MOT PASS/Failure rate for 717 AVE

all MOT test results for 717 AVE represented as a percentage
MOT PASS/Failure rate for 717 AVE
all MOT test results for 717 AVE represented as a percentage

PERCENTAGE OF VEHICLE FAULTS WITH 717 AVE

ALL REPORTED FAULTS, DISPLAYED BY PERCENTAGE OF OCCURRENCE DURING ALL MOT TESTS
PERCENTAGE OF VEHICLE FAULTS WITH 717 AVE
ALL REPORTED FAULTS, DISPLAYED BY PERCENTAGE OF OCCURRENCE DURING ALL MOT TESTS
ADVISORY

FAIL

USER ENTERED

PASS WITH RECTIFICATION

717 AVE annual Faults by type

ALL REPORTED FAULTS, DISPLAYED over time and categorised by type
717 AVE annual Faults by type
ALL REPORTED FAULTS, DISPLAYED over time and categorised by type

RECURRING FAULTS WITH 717 AVE

FAULTS THAT HAVE OCCURED MORE THAN ONCE DURING 717 AVE's MOT HISTORY
RECURRING FAULTS WITH 717 AVE
FAULTS THAT HAVE OCCURED MORE THAN ONCE DURING 717 AVE's MOT HISTORY
Fault Fault Test Date Test Date/Time Reference MOT Test Reference
2 Under body genraly weak in places . Under body genraly weak in places . 01 August 2014 [17:45] 01/08/2014 01 August 2014 [17:42] 01/08/2014 446343714257 446343714257 236233114232 236233114232
2 Offside front seat belt damaged but webbing not significantly weakened (5.2.2a) Offside front seat belt damaged but webbing not significantly weakened (5.2.2a) 26 June 2014 [16:23] 26/06/2014 19 June 2007 [17:51] 19/06/2007 459787174143 459787174143 543660277170 543660277170

ALL 717 AVE ADVISORIES [4]

ALL ADVISORIES, ORDERED by OCCURRENCE DURING 717 AVE's MOT HISTORY
ALL 717 AVE ADVISORIES [4]
ALL ADVISORIES, ORDERED by OCCURRENCE DURING 717 AVE's MOT HISTORY
Fail Faults | source www.vehiclestats.co.uk
Fault Fault Test Date Test Date/Time Reference MOT Test Reference
2 Offside front seat belt damaged but webbing not significantly weakened (5.2.2a) Offside front seat belt damaged but webbing not significantly weakened (5.2.2a) 26 June 2014 [16:23] 26/06/2014 19 June 2007 [17:51] 19/06/2007 459787174143 459787174143 543660277170 543660277170
1 Steering box has a slight oil leak (2.2.d.2e) Steering box has a slight oil leak (2.2.d.2e) 26 June 2014 [16:23] 26/06/2014 459787174143 459787174143
1 Offside front axle king pin has slight play in pin and/or bush (2.5.a.3a) Offside front axle king pin has slight play in pin and/or bush (2.5.a.3a) 26 June 2014 [16:23] 26/06/2014 459787174143 459787174143

ALL 717 AVE Failure Faults [12]

ALL Failure faults, ORDERED by OCCURRENCE DURING 717 AVE's MOT HISTORY
ALL 717 AVE Failure Faults [12]
ALL Failure faults, ORDERED by OCCURRENCE DURING 717 AVE's MOT HISTORY
Fail Faults | source www.vehiclestats.co.uk
Fault Fault Test Date Test Date/Time Reference MOT Test Reference
1 Parking brake: efficiency below requirements (3.7.b.7) Parking brake: efficiency below requirements (3.7.b.7) 01 August 2014 [17:42] 01/08/2014 236233114232 236233114232
1 Windscreen washer provides insufficient washer liquid (8.2.3) Windscreen washer provides insufficient washer liquid (8.2.3) 26 June 2014 [16:23] 26/06/2014 459787174143 459787174143
1 Nearside rear body or chassis has excessive corrosion, seriously affecting its strength within 30cm of the body mountings (6.1.b.2) Nearside rear body or chassis has excessive corrosion, seriously affecting its strength within 30cm of the body mountings (6.1.b.2) 26 June 2014 [16:23] 26/06/2014 459787174143 459787174143
1 Offside rear body or chassis has excessive corrosion, seriously affecting its strength within 30cm of the body mountings (6.1.b.2) Offside rear body or chassis has excessive corrosion, seriously affecting its strength within 30cm of the body mountings (6.1.b.2) 26 June 2014 [16:23] 26/06/2014 459787174143 459787174143
1 Nearside vehicle structure has excessive corrosion, seriously affecting its strength within 30cm of the body mountings (6.1.b.2) Nearside vehicle structure has excessive corrosion, seriously affecting its strength within 30cm of the body mountings (6.1.b.2) 26 June 2014 [16:23] 26/06/2014 459787174143 459787174143
1 Fuel pipe insecure (7.2.1) Fuel pipe insecure (7.2.1) 26 June 2014 [16:23] 26/06/2014 459787174143 459787174143
1 Brakes imbalanced across an axle (3.7.b.5b) Brakes imbalanced across an axle (3.7.b.5b) 26 June 2014 [16:23] 26/06/2014 459787174143 459787174143
1 Nearside rear vehicle structure has excessive corrosion, seriously affecting its strength within 30cm of the body mountings (6.1.b.2) Nearside rear vehicle structure has excessive corrosion, seriously affecting its strength within 30cm of the body mountings (6.1.b.2) 16 June 2011 [12:49] 16/06/2011 918387061173 918387061173
1 Offside rear suspension component mounting prescribed area is excessively corroded (2.4.a.3) Offside rear suspension component mounting prescribed area is excessively corroded (2.4.a.3) 19 June 2007 [17:51] 19/06/2007 543660277170 543660277170
1 Nearside front brake binding (3.7.b.1) Nearside front brake binding (3.7.b.1) 26 June 2006 [15:40] 26/06/2006 610317476108 610317476108

ALL 717 AVE User Entered Faults [7]

ALL User Entered faults, ORDERED by OCCURRENCE DURING 717 AVE's MOT HISTORY
ALL 717 AVE User Entered Faults [7]
ALL User Entered faults, ORDERED by OCCURRENCE DURING 717 AVE's MOT HISTORY
User Entered Faults | source www.vehiclestats.co.uk
Fault Fault Test Date Test Date/Time Reference MOT Test Reference
2 Under body genraly weak in places . Under body genraly weak in places . 01 August 2014 [17:45] 01/08/2014 01 August 2014 [17:42] 01/08/2014 446343714257 446343714257 236233114232 236233114232
1 Slight play in front wheels Slight play in front wheels 24 June 2013 [12:05] 24/06/2013 787555273155 787555273155
1 Nearside rear seat belt doesnt extend Nearside rear seat belt doesnt extend 24 June 2013 [12:05] 24/06/2013 787555273155 787555273155
1 Offside front seat belt frayed Offside front seat belt frayed 24 June 2013 [12:05] 24/06/2013 787555273155 787555273155
1 Nearside front track rod inner ball joint clip loose Nearside front track rod inner ball joint clip loose 24 June 2013 [12:05] 24/06/2013 787555273155 787555273155
1 Front droplink bushes cracked and perished Front droplink bushes cracked and perished 24 June 2013 [12:05] 24/06/2013 787555273155 787555273155

ALL 717 AVE Pass With Rectification Faults [2]

ALL Pass With Rectification faults, ORDERED by OCCURRENCE DURING 717 AVE's MOT HISTORY
ALL 717 AVE Pass With Rectification Faults [2]
ALL Pass With Rectification faults, ORDERED by OCCURRENCE DURING 717 AVE's MOT HISTORY
Pass With Rectification Faults | source www.vehiclestats.co.uk
Fault Fault Test Date Test Date/Time Reference MOT Test Reference
1 Nearside registration plate lamp not working (1.1.c.1d) Nearside registration plate lamp not working (1.1.c.1d) 07 July 2015 [10:15] 07/07/2015 567148885154 567148885154
1 Offside stop lamp insecure (1.2.1a) Offside stop lamp insecure (1.2.1a) 07 July 2015 [10:15] 07/07/2015 567148885154 567148885154

MOT TEST: 06 July 2017 10:37:29 PASSED
MOT TEST: 06 July 2017 10:37:29 PASSED

This test (379275257580) was completed on the 06 July 2017 10:37:29 and PASSED the requirements for a valid MOT with 0 comments.

This test (379275257580) was completed on the 06 July 2017 10:37:29 and PASSED the requirements for a valid MOT with 0 comments.

Recorded mileage: 76,371

Recorded mileage: 76,371


MOT TEST: 22 July 2016 13:57:13 PASSED
MOT TEST: 22 July 2016 13:57:13 PASSED

This test (662151063657) was completed on the 22 July 2016 13:57:13 and PASSED the requirements for a valid MOT with 0 comments.

This test (662151063657) was completed on the 22 July 2016 13:57:13 and PASSED the requirements for a valid MOT with 0 comments.

Recorded mileage: 76,052

Recorded mileage: 76,052


MOT TEST: 07 July 2015 10:15:25 PASSED
MOT TEST: 07 July 2015 10:15:25 PASSED

This test (906068985120) was completed on the 07 July 2015 10:15:25 and PASSED the requirements for a valid MOT with 0 comments.

This test (906068985120) was completed on the 07 July 2015 10:15:25 and PASSED the requirements for a valid MOT with 0 comments.

Recorded mileage: 75,781

Recorded mileage: 75,781


MOT TEST: 07 July 2015 10:15:25 FAILED
MOT TEST: 07 July 2015 10:15:25 FAILED

This test (567148885154) was completed on the 07 July 2015 10:15:25 and FAILED the requirements for a valid MOT with 2 comments.

This test (567148885154) was completed on the 07 July 2015 10:15:25 and FAILED the requirements for a valid MOT with 2 comments.

Recorded mileage: 75,781

Recorded mileage: 75,781


PASS WITH RECTIFICATION


MOT TEST: 01 August 2014 17:45:43 PASSED
MOT TEST: 01 August 2014 17:45:43 PASSED

This test (446343714257) was completed on the 01 August 2014 17:45:43 and PASSED the requirements for a valid MOT with 1 comments.

This test (446343714257) was completed on the 01 August 2014 17:45:43 and PASSED the requirements for a valid MOT with 1 comments.

Recorded mileage: 75,629

Recorded mileage: 75,629


USER ENTERED


MOT TEST: 01 August 2014 17:42:56 FAILED
MOT TEST: 01 August 2014 17:42:56 FAILED

This test (236233114232) was completed on the 01 August 2014 17:42:56 and FAILED the requirements for a valid MOT with 2 comments.

This test (236233114232) was completed on the 01 August 2014 17:42:56 and FAILED the requirements for a valid MOT with 2 comments.

Recorded mileage: 75,629

Recorded mileage: 75,629


FAIL

USER ENTERED


MOT TEST: 26 June 2014 16:23:05 FAILED
MOT TEST: 26 June 2014 16:23:05 FAILED

This test (459787174143) was completed on the 26 June 2014 16:23:05 and FAILED the requirements for a valid MOT with 11 comments.

This test (459787174143) was completed on the 26 June 2014 16:23:05 and FAILED the requirements for a valid MOT with 11 comments.

Recorded mileage: 75,619

Recorded mileage: 75,619


ADVISORY

FAIL


MOT TEST: 24 June 2013 12:05:37 PASSED
MOT TEST: 24 June 2013 12:05:37 PASSED

This test (787555273155) was completed on the 24 June 2013 12:05:37 and PASSED the requirements for a valid MOT with 5 comments.

This test (787555273155) was completed on the 24 June 2013 12:05:37 and PASSED the requirements for a valid MOT with 5 comments.

Recorded mileage: 75,208

Recorded mileage: 75,208


USER ENTERED


MOT TEST: 21 June 2012 17:48:25 PASSED
MOT TEST: 21 June 2012 17:48:25 PASSED

This test (408983572130) was completed on the 21 June 2012 17:48:25 and PASSED the requirements for a valid MOT with 0 comments.

This test (408983572130) was completed on the 21 June 2012 17:48:25 and PASSED the requirements for a valid MOT with 0 comments.

Recorded mileage: 74,760

Recorded mileage: 74,760


MOT TEST: 17 June 2011 17:07:45 PASSED
MOT TEST: 17 June 2011 17:07:45 PASSED

This test (208538061414) was completed on the 17 June 2011 17:07:45 and PASSED the requirements for a valid MOT with 0 comments.

This test (208538061414) was completed on the 17 June 2011 17:07:45 and PASSED the requirements for a valid MOT with 0 comments.

Recorded mileage: 73,925

Recorded mileage: 73,925


MOT TEST: 16 June 2011 12:49:07 FAILED
MOT TEST: 16 June 2011 12:49:07 FAILED

This test (918387061173) was completed on the 16 June 2011 12:49:07 and FAILED the requirements for a valid MOT with 1 comments.

This test (918387061173) was completed on the 16 June 2011 12:49:07 and FAILED the requirements for a valid MOT with 1 comments.

Recorded mileage: 73,925

Recorded mileage: 73,925


FAIL


MOT TEST: 23 June 2010 09:27:30 PASSED
MOT TEST: 23 June 2010 09:27:30 PASSED

This test (790124470183) was completed on the 23 June 2010 09:27:30 and PASSED the requirements for a valid MOT with 0 comments.

This test (790124470183) was completed on the 23 June 2010 09:27:30 and PASSED the requirements for a valid MOT with 0 comments.

Recorded mileage: 73,147

Recorded mileage: 73,147


MOT TEST: 24 June 2009 12:59:44 PASSED
MOT TEST: 24 June 2009 12:59:44 PASSED

This test (890585079162) was completed on the 24 June 2009 12:59:44 and PASSED the requirements for a valid MOT with 0 comments.

This test (890585079162) was completed on the 24 June 2009 12:59:44 and PASSED the requirements for a valid MOT with 0 comments.

Recorded mileage: 72,237

Recorded mileage: 72,237


MOT TEST: 20 June 2008 11:41:54 PASSED
MOT TEST: 20 June 2008 11:41:54 PASSED

This test (901292878138) was completed on the 20 June 2008 11:41:54 and PASSED the requirements for a valid MOT with 0 comments.

This test (901292878138) was completed on the 20 June 2008 11:41:54 and PASSED the requirements for a valid MOT with 0 comments.

Recorded mileage: 71,158

Recorded mileage: 71,158


MOT TEST: 21 June 2007 12:18:09 PASSED
MOT TEST: 21 June 2007 12:18:09 PASSED

This test (290762177432) was completed on the 21 June 2007 12:18:09 and PASSED the requirements for a valid MOT with 0 comments.

This test (290762177432) was completed on the 21 June 2007 12:18:09 and PASSED the requirements for a valid MOT with 0 comments.

Recorded mileage: 70,292

Recorded mileage: 70,292


MOT TEST: 19 June 2007 17:51:12 FAILED
MOT TEST: 19 June 2007 17:51:12 FAILED

This test (543660277170) was completed on the 19 June 2007 17:51:12 and FAILED the requirements for a valid MOT with 2 comments.

This test (543660277170) was completed on the 19 June 2007 17:51:12 and FAILED the requirements for a valid MOT with 2 comments.

Recorded mileage: 70,286

Recorded mileage: 70,286


ADVISORY

FAIL


MOT TEST: 29 June 2006 11:54:34 PASSED
MOT TEST: 29 June 2006 11:54:34 PASSED

This test (894590786192) was completed on the 29 June 2006 11:54:34 and PASSED the requirements for a valid MOT with 0 comments.

This test (894590786192) was completed on the 29 June 2006 11:54:34 and PASSED the requirements for a valid MOT with 0 comments.

Recorded mileage: 69,478

Recorded mileage: 69,478


MOT TEST: 26 June 2006 15:40:27 FAILED
MOT TEST: 26 June 2006 15:40:27 FAILED

This test (610317476108) was completed on the 26 June 2006 15:40:27 and FAILED the requirements for a valid MOT with 1 comments.

This test (610317476108) was completed on the 26 June 2006 15:40:27 and FAILED the requirements for a valid MOT with 1 comments.

Recorded mileage: 69,478

Recorded mileage: 69,478


FAIL