717 UXL


717UXL is registered to a Red 1938, Morris 8 with a Petrol engine. It Failed its most recent MOT Test on the 23 February 2013

4 unique faults (4 Total) reported in its MOT History (10 Tests).

0 common/recurring faults.

80% (8) MOT Pass Rate and a 20% (2) MOT Failure Rate.

46,678 recorded miles.

717 UXL


717UXL is registered to a Red 1938, Morris 8 with a Petrol engine. It Failed its most recent MOT Test on the 23 February 2013

4 unique faults (4 Total) reported in its MOT History (10 Tests).

0 common/recurring faults.

80% (8) MOT Pass Rate and a 20% (2) MOT Failure Rate.

46,678 recorded miles.

MOT PASS/Failure rate for 717 UXL

all MOT test results for 717 UXL represented as a percentage
MOT PASS/Failure rate for 717 UXL
all MOT test results for 717 UXL represented as a percentage

PERCENTAGE OF VEHICLE FAULTS WITH 717 UXL

ALL REPORTED FAULTS, DISPLAYED BY PERCENTAGE OF OCCURRENCE DURING ALL MOT TESTS
PERCENTAGE OF VEHICLE FAULTS WITH 717 UXL
ALL REPORTED FAULTS, DISPLAYED BY PERCENTAGE OF OCCURRENCE DURING ALL MOT TESTS
FAIL

USER ENTERED

717 UXL annual Faults by type

ALL REPORTED FAULTS, DISPLAYED over time and categorised by type
717 UXL annual Faults by type
ALL REPORTED FAULTS, DISPLAYED over time and categorised by type

ALL 717 UXL Failure Faults [3]

ALL Failure faults, ORDERED by OCCURRENCE DURING 717 UXL's MOT HISTORY
ALL 717 UXL Failure Faults [3]
ALL Failure faults, ORDERED by OCCURRENCE DURING 717 UXL's MOT HISTORY
Fail Faults | source www.vehiclestats.co.uk
Fault Fault Test Date Test Date/Time Reference MOT Test Reference
1 Offside front headlamp not working on main beam (1.7.5a) Offside front headlamp not working on main beam (1.7.5a) 17 March 2011 [12:20] 17/03/2011 155296571454 155296571454
1 Steering box has relative movement between sector shaft and the drop arm (2.2.b.1b) Steering box has relative movement between sector shaft and the drop arm (2.2.b.1b) 04 March 2006 [08:12] 04/03/2006 422133666056 422133666056
1 Nearside axle king pin has excessive play in pin and/or bush adversely affecting the steering (2.5.a.3a) Nearside axle king pin has excessive play in pin and/or bush adversely affecting the steering (2.5.a.3a) 04 March 2006 [08:12] 04/03/2006 422133666056 422133666056

ALL 717 UXL User Entered Faults [1]

ALL User Entered faults, ORDERED by OCCURRENCE DURING 717 UXL's MOT HISTORY
ALL 717 UXL User Entered Faults [1]
ALL User Entered faults, ORDERED by OCCURRENCE DURING 717 UXL's MOT HISTORY
User Entered Faults | source www.vehiclestats.co.uk
Fault Fault Test Date Test Date/Time Reference MOT Test Reference
1 Cracks in rear tyres sidewalls/ rear shockers damp Cracks in rear tyres sidewalls/ rear shockers damp 06 April 2009 [11:21] 06/04/2009 920406999028 920406999028

MOT TEST: 23 February 2013 09:37:14 PASSED
MOT TEST: 23 February 2013 09:37:14 PASSED

This test (166764753423) was completed on the 23 February 2013 09:37:14 and PASSED the requirements for a valid MOT with 0 comments.

This test (166764753423) was completed on the 23 February 2013 09:37:14 and PASSED the requirements for a valid MOT with 0 comments.

Recorded mileage: 46,678

Recorded mileage: 46,678


MOT TEST: 27 March 2012 10:11:17 PASSED
MOT TEST: 27 March 2012 10:11:17 PASSED

This test (697197182084) was completed on the 27 March 2012 10:11:17 and PASSED the requirements for a valid MOT with 0 comments.

This test (697197182084) was completed on the 27 March 2012 10:11:17 and PASSED the requirements for a valid MOT with 0 comments.

Recorded mileage: 46,389

Recorded mileage: 46,389


MOT TEST: 26 March 2011 09:58:11 PASSED
MOT TEST: 26 March 2011 09:58:11 PASSED

This test (165895081058) was completed on the 26 March 2011 09:58:11 and PASSED the requirements for a valid MOT with 0 comments.

This test (165895081058) was completed on the 26 March 2011 09:58:11 and PASSED the requirements for a valid MOT with 0 comments.

Recorded mileage: 45,705

Recorded mileage: 45,705


MOT TEST: 17 March 2011 12:20:30 FAILED
MOT TEST: 17 March 2011 12:20:30 FAILED

This test (155296571454) was completed on the 17 March 2011 12:20:30 and FAILED the requirements for a valid MOT with 1 comments.

This test (155296571454) was completed on the 17 March 2011 12:20:30 and FAILED the requirements for a valid MOT with 1 comments.

Recorded mileage: 45,700

Recorded mileage: 45,700


FAIL


MOT TEST: 10 April 2010 09:40:13 PASSED
MOT TEST: 10 April 2010 09:40:13 PASSED

This test (963380700118) was completed on the 10 April 2010 09:40:13 and PASSED the requirements for a valid MOT with 0 comments.

This test (963380700118) was completed on the 10 April 2010 09:40:13 and PASSED the requirements for a valid MOT with 0 comments.

Recorded mileage: 44,139

Recorded mileage: 44,139


MOT TEST: 06 April 2009 11:21:19 PASSED
MOT TEST: 06 April 2009 11:21:19 PASSED

This test (920406999028) was completed on the 06 April 2009 11:21:19 and PASSED the requirements for a valid MOT with 1 comments.

This test (920406999028) was completed on the 06 April 2009 11:21:19 and PASSED the requirements for a valid MOT with 1 comments.

Recorded mileage: 43,421

Recorded mileage: 43,421


USER ENTERED


MOT TEST: 25 April 2008 08:11:35 PASSED
MOT TEST: 25 April 2008 08:11:35 PASSED

This test (753226218121) was completed on the 25 April 2008 08:11:35 and PASSED the requirements for a valid MOT with 0 comments.

This test (753226218121) was completed on the 25 April 2008 08:11:35 and PASSED the requirements for a valid MOT with 0 comments.

Recorded mileage: 43,168

Recorded mileage: 43,168


MOT TEST: 19 March 2007 07:14:56 PASSED
MOT TEST: 19 March 2007 07:14:56 PASSED

This test (121058077445) was completed on the 19 March 2007 07:14:56 and PASSED the requirements for a valid MOT with 0 comments.

This test (121058077445) was completed on the 19 March 2007 07:14:56 and PASSED the requirements for a valid MOT with 0 comments.

Recorded mileage: 42,804

Recorded mileage: 42,804


MOT TEST: 22 April 2006 07:11:37 PASSED
MOT TEST: 22 April 2006 07:11:37 PASSED

This test (904332216125) was completed on the 22 April 2006 07:11:37 and PASSED the requirements for a valid MOT with 0 comments.

This test (904332216125) was completed on the 22 April 2006 07:11:37 and PASSED the requirements for a valid MOT with 0 comments.

Recorded mileage: 42,459

Recorded mileage: 42,459


MOT TEST: 04 March 2006 08:12:10 FAILED
MOT TEST: 04 March 2006 08:12:10 FAILED

This test (422133666056) was completed on the 04 March 2006 08:12:10 and FAILED the requirements for a valid MOT with 2 comments.

This test (422133666056) was completed on the 04 March 2006 08:12:10 and FAILED the requirements for a valid MOT with 2 comments.

Recorded mileage: 42,431

Recorded mileage: 42,431


FAIL