717 VPA


717VPA is registered to a Grey 1961, Morris Minor with a Petrol engine. It Failed its most recent MOT Test on the 03 June 2011

5 unique faults (5 Total) reported in its MOT History (2 Tests).

0 common/recurring faults.

50% (1) MOT Pass Rate and a 50% (1) MOT Failure Rate.

32,462 recorded miles.

717 VPA


717VPA is registered to a Grey 1961, Morris Minor with a Petrol engine. It Failed its most recent MOT Test on the 03 June 2011

5 unique faults (5 Total) reported in its MOT History (2 Tests).

0 common/recurring faults.

50% (1) MOT Pass Rate and a 50% (1) MOT Failure Rate.

32,462 recorded miles.

MOT PASS/Failure rate for 717 VPA

all MOT test results for 717 VPA represented as a percentage
MOT PASS/Failure rate for 717 VPA
all MOT test results for 717 VPA represented as a percentage

PERCENTAGE OF VEHICLE FAULTS WITH 717 VPA

ALL REPORTED FAULTS, DISPLAYED BY PERCENTAGE OF OCCURRENCE DURING ALL MOT TESTS
PERCENTAGE OF VEHICLE FAULTS WITH 717 VPA
ALL REPORTED FAULTS, DISPLAYED BY PERCENTAGE OF OCCURRENCE DURING ALL MOT TESTS
FAIL

717 VPA annual Faults by type

ALL REPORTED FAULTS, DISPLAYED over time and categorised by type
717 VPA annual Faults by type
ALL REPORTED FAULTS, DISPLAYED over time and categorised by type

ALL 717 VPA Failure Faults [5]

ALL Failure faults, ORDERED by OCCURRENCE DURING 717 VPA's MOT HISTORY
ALL 717 VPA Failure Faults [5]
ALL Failure faults, ORDERED by OCCURRENCE DURING 717 VPA's MOT HISTORY
Fail Faults | source www.vehiclestats.co.uk
Fault Fault Test Date Test Date/Time Reference MOT Test Reference
1 Nearside front vehicle structure has excessive corrosion which adversely affects braking or steering (6.1.a.1) Nearside front vehicle structure has excessive corrosion which adversely affects braking or steering (6.1.a.1) 03 June 2011 [13:56] 03/06/2011 979334951190 979334951190
1 Nearside vehicle structure has excessive corrosion, seriously affecting its strength within 30cm of the body mountings (6.1.b.2) Nearside vehicle structure has excessive corrosion, seriously affecting its strength within 30cm of the body mountings (6.1.b.2) 03 June 2011 [13:56] 03/06/2011 979334951190 979334951190
1 Nearside rear vehicle structure has excessive corrosion, seriously affecting its strength within 30cm of the body mountings (6.1.b.2) Nearside rear vehicle structure has excessive corrosion, seriously affecting its strength within 30cm of the body mountings (6.1.b.2) 03 June 2011 [13:56] 03/06/2011 979334951190 979334951190
1 Offside headlamp not working on dipped beam (1.7.5a) Offside headlamp not working on dipped beam (1.7.5a) 03 June 2011 [13:56] 03/06/2011 979334951190 979334951190
1 Offside headlamp not working on main beam (1.7.5a) Offside headlamp not working on main beam (1.7.5a) 03 June 2011 [13:56] 03/06/2011 979334951190 979334951190

MOT TEST: 03 June 2011 13:56:43 FAILED
MOT TEST: 03 June 2011 13:56:43 FAILED

This test (979334951190) was completed on the 03 June 2011 13:56:43 and FAILED the requirements for a valid MOT with 5 comments.

This test (979334951190) was completed on the 03 June 2011 13:56:43 and FAILED the requirements for a valid MOT with 5 comments.

Recorded mileage: 32,462

Recorded mileage: 32,462


FAIL


MOT TEST: 19 October 2007 12:20:35 PASSED
MOT TEST: 19 October 2007 12:20:35 PASSED

This test (743662197272) was completed on the 19 October 2007 12:20:35 and PASSED the requirements for a valid MOT with 0 comments.

This test (743662197272) was completed on the 19 October 2007 12:20:35 and PASSED the requirements for a valid MOT with 0 comments.

Recorded mileage: 25,278

Recorded mileage: 25,278