720 EPY


720EPY is registered to a Grey 1962, Morris Mini cooper with a Petrol engine. It Passed its most recent MOT Test on the 27 July 2018

7 unique faults (8 Total) reported in its MOT History (15 Tests).

1 common/recurring faults.

87% (13) MOT Pass Rate and a 13% (2) MOT Failure Rate.

71,575 recorded miles.

720 EPY


720EPY is registered to a Grey 1962, Morris Mini cooper with a Petrol engine. It Passed its most recent MOT Test on the 27 July 2018

7 unique faults (8 Total) reported in its MOT History (15 Tests).

1 common/recurring faults.

87% (13) MOT Pass Rate and a 13% (2) MOT Failure Rate.

71,575 recorded miles.

MOT PASS/Failure rate for 720 EPY

all MOT test results for 720 EPY represented as a percentage
MOT PASS/Failure rate for 720 EPY
all MOT test results for 720 EPY represented as a percentage

PERCENTAGE OF VEHICLE FAULTS WITH 720 EPY

ALL REPORTED FAULTS, DISPLAYED BY PERCENTAGE OF OCCURRENCE DURING ALL MOT TESTS
PERCENTAGE OF VEHICLE FAULTS WITH 720 EPY
ALL REPORTED FAULTS, DISPLAYED BY PERCENTAGE OF OCCURRENCE DURING ALL MOT TESTS
ADVISORY

FAIL

USER ENTERED

PASS WITH RECTIFICATION

720 EPY annual Faults by type

ALL REPORTED FAULTS, DISPLAYED over time and categorised by type
720 EPY annual Faults by type
ALL REPORTED FAULTS, DISPLAYED over time and categorised by type

ALL 720 EPY ADVISORIES [1]

ALL ADVISORIES, ORDERED by OCCURRENCE DURING 720 EPY's MOT HISTORY
ALL 720 EPY ADVISORIES [1]
ALL ADVISORIES, ORDERED by OCCURRENCE DURING 720 EPY's MOT HISTORY
Advisory Faults | source www.vehiclestats.co.uk
Fault Fault Test Date Test Date/Time Reference MOT Test Reference
1 Offside front brake pad(s) wearing thin (3.5.1g) Offside front brake pad(s) wearing thin (3.5.1g) 07 May 2010 [12:26] 07/05/2010 260917020409 260917020409

ALL 720 EPY Failure Faults [4]

ALL Failure faults, ORDERED by OCCURRENCE DURING 720 EPY's MOT HISTORY
ALL 720 EPY Failure Faults [4]
ALL Failure faults, ORDERED by OCCURRENCE DURING 720 EPY's MOT HISTORY
Pass With Rectification Faults | source www.vehiclestats.co.uk
Fault Fault Test Date Test Date/Time Reference MOT Test Reference
2 Offside stop lamp not working (1.2.1b) Offside stop lamp not working (1.2.1b) 28 July 2017 [15:12] 28/07/2017 29 June 2013 [11:23] 29/06/2013 334122392113 334122392113 258430683113 258430683113
1 Brakes imbalanced across an axle (3.7.b.5b) Brakes imbalanced across an axle (3.7.b.5b) 29 June 2013 [11:23] 29/06/2013 258430683113 258430683113
1 Offside rear brake recording little or no effort (3.7.b.5a) Offside rear brake recording little or no effort (3.7.b.5a) 29 June 2013 [11:23] 29/06/2013 258430683113 258430683113

ALL 720 EPY User Entered Faults [2]

ALL User Entered faults, ORDERED by OCCURRENCE DURING 720 EPY's MOT HISTORY
ALL 720 EPY User Entered Faults [2]
ALL User Entered faults, ORDERED by OCCURRENCE DURING 720 EPY's MOT HISTORY
Advisory Faults | source www.vehiclestats.co.uk
Fault Fault Test Date Test Date/Time Reference MOT Test Reference
1 Offside front tyre wearing slightly on inside of tread Offside front tyre wearing slightly on inside of tread 07 May 2010 [12:26] 07/05/2010 260917020409 260917020409
1 Advise on decelorometer brake test vehicle slightly pulling one way Advise on decelorometer brake test vehicle slightly pulling one way 13 May 2009 [14:21] 13/05/2009 232143739185 232143739185

ALL 720 EPY Pass With Rectification Faults [1]

ALL Pass With Rectification faults, ORDERED by OCCURRENCE DURING 720 EPY's MOT HISTORY
ALL 720 EPY Pass With Rectification Faults [1]
ALL Pass With Rectification faults, ORDERED by OCCURRENCE DURING 720 EPY's MOT HISTORY
Pass With Rectification Faults | source www.vehiclestats.co.uk
Fault Fault Test Date Test Date/Time Reference MOT Test Reference
1 Nearside front position lamp(s) not working (1.1.a.3b) Nearside front position lamp(s) not working (1.1.a.3b) 28 July 2017 [15:12] 28/07/2017 334122392113 334122392113

MOT TEST: 27 July 2018 15:35:15 PASSED
MOT TEST: 27 July 2018 15:35:15 PASSED

This test (162278471774) was completed on the 27 July 2018 15:35:15 and PASSED the requirements for a valid MOT with 0 comments.

This test (162278471774) was completed on the 27 July 2018 15:35:15 and PASSED the requirements for a valid MOT with 0 comments.

Recorded mileage: 71,575

Recorded mileage: 71,575


MOT TEST: 28 July 2017 15:46:27 PASSED
MOT TEST: 28 July 2017 15:46:27 PASSED

This test (640586078086) was completed on the 28 July 2017 15:46:27 and PASSED the requirements for a valid MOT with 0 comments.

This test (640586078086) was completed on the 28 July 2017 15:46:27 and PASSED the requirements for a valid MOT with 0 comments.

Recorded mileage: 71,348

Recorded mileage: 71,348


MOT TEST: 28 July 2017 15:12:37 FAILED
MOT TEST: 28 July 2017 15:12:37 FAILED

This test (334122392113) was completed on the 28 July 2017 15:12:37 and FAILED the requirements for a valid MOT with 2 comments.

This test (334122392113) was completed on the 28 July 2017 15:12:37 and FAILED the requirements for a valid MOT with 2 comments.

Recorded mileage: 71,348

Recorded mileage: 71,348


FAIL

PASS WITH RECTIFICATION


MOT TEST: 18 July 2016 14:02:34 PASSED
MOT TEST: 18 July 2016 14:02:34 PASSED

This test (227032652739) was completed on the 18 July 2016 14:02:34 and PASSED the requirements for a valid MOT with 0 comments.

This test (227032652739) was completed on the 18 July 2016 14:02:34 and PASSED the requirements for a valid MOT with 0 comments.

Recorded mileage: 71,046

Recorded mileage: 71,046


MOT TEST: 17 July 2015 10:42:55 PASSED
MOT TEST: 17 July 2015 10:42:55 PASSED

This test (578878295160) was completed on the 17 July 2015 10:42:55 and PASSED the requirements for a valid MOT with 0 comments.

This test (578878295160) was completed on the 17 July 2015 10:42:55 and PASSED the requirements for a valid MOT with 0 comments.

Recorded mileage: 70,642

Recorded mileage: 70,642


MOT TEST: 18 July 2014 10:29:33 PASSED
MOT TEST: 18 July 2014 10:29:33 PASSED

This test (147009094129) was completed on the 18 July 2014 10:29:33 and PASSED the requirements for a valid MOT with 0 comments.

This test (147009094129) was completed on the 18 July 2014 10:29:33 and PASSED the requirements for a valid MOT with 0 comments.

Recorded mileage: 70,049

Recorded mileage: 70,049


MOT TEST: 22 July 2013 14:03:28 PASSED
MOT TEST: 22 July 2013 14:03:28 PASSED

This test (709333003253) was completed on the 22 July 2013 14:03:28 and PASSED the requirements for a valid MOT with 0 comments.

This test (709333003253) was completed on the 22 July 2013 14:03:28 and PASSED the requirements for a valid MOT with 0 comments.

Recorded mileage: 69,130

Recorded mileage: 69,130


MOT TEST: 29 June 2013 11:23:47 FAILED
MOT TEST: 29 June 2013 11:23:47 FAILED

This test (258430683113) was completed on the 29 June 2013 11:23:47 and FAILED the requirements for a valid MOT with 3 comments.

This test (258430683113) was completed on the 29 June 2013 11:23:47 and FAILED the requirements for a valid MOT with 3 comments.

Recorded mileage: 69,111

Recorded mileage: 69,111


FAIL


MOT TEST: 29 June 2012 16:08:13 PASSED
MOT TEST: 29 June 2012 16:08:13 PASSED

This test (138861382129) was completed on the 29 June 2012 16:08:13 and PASSED the requirements for a valid MOT with 0 comments.

This test (138861382129) was completed on the 29 June 2012 16:08:13 and PASSED the requirements for a valid MOT with 0 comments.

Recorded mileage: 68,844

Recorded mileage: 68,844


MOT TEST: 24 June 2011 10:24:02 PASSED
MOT TEST: 24 June 2011 10:24:02 PASSED

This test (196485371149) was completed on the 24 June 2011 10:24:02 and PASSED the requirements for a valid MOT with 0 comments.

This test (196485371149) was completed on the 24 June 2011 10:24:02 and PASSED the requirements for a valid MOT with 0 comments.

Recorded mileage: 68,444

Recorded mileage: 68,444


MOT TEST: 07 May 2010 12:26:16 PASSED
MOT TEST: 07 May 2010 12:26:16 PASSED

This test (260917020409) was completed on the 07 May 2010 12:26:16 and PASSED the requirements for a valid MOT with 2 comments.

This test (260917020409) was completed on the 07 May 2010 12:26:16 and PASSED the requirements for a valid MOT with 2 comments.

Recorded mileage: 68,424

Recorded mileage: 68,424


ADVISORY

USER ENTERED


MOT TEST: 13 May 2009 14:21:18 PASSED
MOT TEST: 13 May 2009 14:21:18 PASSED

This test (232143739185) was completed on the 13 May 2009 14:21:18 and PASSED the requirements for a valid MOT with 1 comments.

This test (232143739185) was completed on the 13 May 2009 14:21:18 and PASSED the requirements for a valid MOT with 1 comments.

Recorded mileage: 67,534

Recorded mileage: 67,534


USER ENTERED


MOT TEST: 08 May 2008 10:24:35 PASSED
MOT TEST: 08 May 2008 10:24:35 PASSED

This test (670239528185) was completed on the 08 May 2008 10:24:35 and PASSED the requirements for a valid MOT with 0 comments.

This test (670239528185) was completed on the 08 May 2008 10:24:35 and PASSED the requirements for a valid MOT with 0 comments.

Recorded mileage: 66,270

Recorded mileage: 66,270


MOT TEST: 11 May 2007 11:59:01 PASSED
MOT TEST: 11 May 2007 11:59:01 PASSED

This test (984651037131) was completed on the 11 May 2007 11:59:01 and PASSED the requirements for a valid MOT with 0 comments.

This test (984651037131) was completed on the 11 May 2007 11:59:01 and PASSED the requirements for a valid MOT with 0 comments.

Recorded mileage: 64,587

Recorded mileage: 64,587


MOT TEST: 05 May 2006 17:41:19 PASSED
MOT TEST: 05 May 2006 17:41:19 PASSED

This test (811535726152) was completed on the 05 May 2006 17:41:19 and PASSED the requirements for a valid MOT with 0 comments.

This test (811535726152) was completed on the 05 May 2006 17:41:19 and PASSED the requirements for a valid MOT with 0 comments.

Recorded mileage: 62,380

Recorded mileage: 62,380