720 XUV


720XUV is registered to a Grey 1960, Morris Minor 1000 with a Petrol engine. It Failed its most recent MOT Test on the 01 September 2011

8 unique faults (8 Total) reported in its MOT History (5 Tests).

0 common/recurring faults.

60% (3) MOT Pass Rate and a 40% (2) MOT Failure Rate.

57,645 recorded miles.

720 XUV


720XUV is registered to a Grey 1960, Morris Minor 1000 with a Petrol engine. It Failed its most recent MOT Test on the 01 September 2011

8 unique faults (8 Total) reported in its MOT History (5 Tests).

0 common/recurring faults.

60% (3) MOT Pass Rate and a 40% (2) MOT Failure Rate.

57,645 recorded miles.

MOT PASS/Failure rate for 720 XUV

all MOT test results for 720 XUV represented as a percentage
MOT PASS/Failure rate for 720 XUV
all MOT test results for 720 XUV represented as a percentage

PERCENTAGE OF VEHICLE FAULTS WITH 720 XUV

ALL REPORTED FAULTS, DISPLAYED BY PERCENTAGE OF OCCURRENCE DURING ALL MOT TESTS
PERCENTAGE OF VEHICLE FAULTS WITH 720 XUV
ALL REPORTED FAULTS, DISPLAYED BY PERCENTAGE OF OCCURRENCE DURING ALL MOT TESTS
ADVISORY

FAIL

720 XUV annual Faults by type

ALL REPORTED FAULTS, DISPLAYED over time and categorised by type
720 XUV annual Faults by type
ALL REPORTED FAULTS, DISPLAYED over time and categorised by type

ALL 720 XUV ADVISORIES [2]

ALL ADVISORIES, ORDERED by OCCURRENCE DURING 720 XUV's MOT HISTORY
ALL 720 XUV ADVISORIES [2]
ALL ADVISORIES, ORDERED by OCCURRENCE DURING 720 XUV's MOT HISTORY
Advisory Faults | source www.vehiclestats.co.uk
Fault Fault Test Date Test Date/Time Reference MOT Test Reference
1 Nearside front steering rack gaiter deteriorated (2.2.d.2d) Nearside front steering rack gaiter deteriorated (2.2.d.2d) 28 August 2009 [16:51] 28/08/2009 843890249261 843890249261
1 Offside front steering rack gaiter deteriorated (2.2.d.2d) Offside front steering rack gaiter deteriorated (2.2.d.2d) 28 August 2009 [16:51] 28/08/2009 843890249261 843890249261

ALL 720 XUV Failure Faults [6]

ALL Failure faults, ORDERED by OCCURRENCE DURING 720 XUV's MOT HISTORY
ALL 720 XUV Failure Faults [6]
ALL Failure faults, ORDERED by OCCURRENCE DURING 720 XUV's MOT HISTORY
Fail Faults | source www.vehiclestats.co.uk
Fault Fault Test Date Test Date/Time Reference MOT Test Reference
1 Nearside rear tyre has a cut in excess of the requirements deep enough to reach the ply or cords (4.1.d.1a) Nearside rear tyre has a cut in excess of the requirements deep enough to reach the ply or cords (4.1.d.1a) 26 August 2011 [10:41] 26/08/2011 937248031278 937248031278
1 Windscreen washer provides insufficient washer liquid (8.2.3) Windscreen washer provides insufficient washer liquid (8.2.3) 26 August 2011 [10:41] 26/08/2011 937248031278 937248031278
1 Parking brake: efficiency below requirements (3.7.c.1b) Parking brake: efficiency below requirements (3.7.c.1b) 26 August 2011 [10:41] 26/08/2011 937248031278 937248031278
1 Offside front headlamp not working on dipped beam (1.7.5a) Offside front headlamp not working on dipped beam (1.7.5a) 19 August 2010 [12:12] 19/08/2010 151571630263 151571630263
1 Offside front headlamp not working on main beam (1.7.5a) Offside front headlamp not working on main beam (1.7.5a) 19 August 2010 [12:12] 19/08/2010 151571630263 151571630263
1 Front windscreen washer provides insufficient washer liquid (8.2.3) Front windscreen washer provides insufficient washer liquid (8.2.3) 19 August 2010 [12:12] 19/08/2010 151571630263 151571630263

MOT TEST: 01 September 2011 15:03:25 PASSED
MOT TEST: 01 September 2011 15:03:25 PASSED

This test (845524241212) was completed on the 01 September 2011 15:03:25 and PASSED the requirements for a valid MOT with 0 comments.

This test (845524241212) was completed on the 01 September 2011 15:03:25 and PASSED the requirements for a valid MOT with 0 comments.

Recorded mileage: 57,645

Recorded mileage: 57,645


MOT TEST: 26 August 2011 10:41:27 FAILED
MOT TEST: 26 August 2011 10:41:27 FAILED

This test (937248031278) was completed on the 26 August 2011 10:41:27 and FAILED the requirements for a valid MOT with 3 comments.

This test (937248031278) was completed on the 26 August 2011 10:41:27 and FAILED the requirements for a valid MOT with 3 comments.

Recorded mileage: 57,635

Recorded mileage: 57,635


FAIL


MOT TEST: 19 August 2010 14:52:09 PASSED
MOT TEST: 19 August 2010 14:52:09 PASSED

This test (634041030243) was completed on the 19 August 2010 14:52:09 and PASSED the requirements for a valid MOT with 0 comments.

This test (634041030243) was completed on the 19 August 2010 14:52:09 and PASSED the requirements for a valid MOT with 0 comments.

Recorded mileage: 57,519

Recorded mileage: 57,519


MOT TEST: 19 August 2010 12:12:04 FAILED
MOT TEST: 19 August 2010 12:12:04 FAILED

This test (151571630263) was completed on the 19 August 2010 12:12:04 and FAILED the requirements for a valid MOT with 3 comments.

This test (151571630263) was completed on the 19 August 2010 12:12:04 and FAILED the requirements for a valid MOT with 3 comments.

Recorded mileage: 57,519

Recorded mileage: 57,519


FAIL


MOT TEST: 28 August 2009 16:51:24 PASSED
MOT TEST: 28 August 2009 16:51:24 PASSED

This test (843890249261) was completed on the 28 August 2009 16:51:24 and PASSED the requirements for a valid MOT with 2 comments.

This test (843890249261) was completed on the 28 August 2009 16:51:24 and PASSED the requirements for a valid MOT with 2 comments.

Recorded mileage: 57,428

Recorded mileage: 57,428


ADVISORY