721 BRK


721BRK is registered to a White 1964, Morris 1000 with a Petrol engine. It Passed its most recent MOT Test on the 25 October 2018

32 unique faults (40 Total) reported in its MOT History (11 Tests).

7 common/recurring faults, the most frequent (3 times) is: Welding has been carried out to the underside of the vehicle.

64% (7) MOT Pass Rate and a 36% (4) MOT Failure Rate.

68,029 recorded miles.

721 BRK


721BRK is registered to a White 1964, Morris 1000 with a Petrol engine. It Passed its most recent MOT Test on the 25 October 2018

32 unique faults (40 Total) reported in its MOT History (11 Tests).

7 common/recurring faults, the most frequent (3 times) is: Welding has been carried out to the underside of the vehicle.

64% (7) MOT Pass Rate and a 36% (4) MOT Failure Rate.

68,029 recorded miles.

MOT PASS/Failure rate for 721 BRK

all MOT test results for 721 BRK represented as a percentage
MOT PASS/Failure rate for 721 BRK
all MOT test results for 721 BRK represented as a percentage

PERCENTAGE OF VEHICLE FAULTS WITH 721 BRK

ALL REPORTED FAULTS, DISPLAYED BY PERCENTAGE OF OCCURRENCE DURING ALL MOT TESTS
PERCENTAGE OF VEHICLE FAULTS WITH 721 BRK
ALL REPORTED FAULTS, DISPLAYED BY PERCENTAGE OF OCCURRENCE DURING ALL MOT TESTS
ADVISORY

FAIL

USER ENTERED

721 BRK annual Faults by type

ALL REPORTED FAULTS, DISPLAYED over time and categorised by type
721 BRK annual Faults by type
ALL REPORTED FAULTS, DISPLAYED over time and categorised by type

RECURRING FAULTS WITH 721 BRK

FAULTS THAT HAVE OCCURED MORE THAN ONCE DURING 721 BRK's MOT HISTORY
RECURRING FAULTS WITH 721 BRK
FAULTS THAT HAVE OCCURED MORE THAN ONCE DURING 721 BRK's MOT HISTORY
Fault Fault Test Date Test Date/Time Reference MOT Test Reference
3 Welding has been carried out to the underside of the vehicle Welding has been carried out to the underside of the vehicle 25 October 2018 [10:49] 25/10/2018 17 October 2018 [10:09] 17/10/2018 21 September 2016 [11:17] 21/09/2016 336259096056 336259096056 685064532702 685064532702 738431032960 738431032960
2 Corrosion to the underside of the vehicle Corrosion to the underside of the vehicle 25 October 2018 [10:49] 25/10/2018 17 October 2018 [10:09] 17/10/2018 336259096056 336259096056 685064532702 685064532702
2 Oil leak, but not excessive (8.4.1 (a) (i)) Oil leak, but not excessive (8.4.1 (a) (i)) 25 October 2018 [10:49] 25/10/2018 17 October 2018 [10:09] 17/10/2018 336259096056 336259096056 685064532702 685064532702
2 Fuel pipe/s corroded () Fuel pipe/s corroded () 04 October 2017 [14:37] 04/10/2017 27 September 2017 [09:53] 27/09/2017 363682798312 363682798312 743913344347 743913344347
2 Oil leak () Oil leak () 04 October 2017 [14:37] 04/10/2017 27 September 2017 [09:53] 27/09/2017 363682798312 363682798312 743913344347 743913344347
2 Parking brake: efficiency below requirements (3.7.b.7) Parking brake: efficiency below requirements (3.7.b.7) 27 September 2017 [09:53] 27/09/2017 28 August 2013 [16:13] 28/08/2013 743913344347 743913344347 405050243272 405050243272
2 Brakes imbalanced across an axle (3.7.b.5b) Brakes imbalanced across an axle (3.7.b.5b) 28 August 2013 [16:13] 28/08/2013 05 October 2005 [15:09] 05/10/2005 405050243272 405050243272 291378575210 291378575210

ALL 721 BRK ADVISORIES [13]

ALL ADVISORIES, ORDERED by OCCURRENCE DURING 721 BRK's MOT HISTORY
ALL 721 BRK ADVISORIES [13]
ALL ADVISORIES, ORDERED by OCCURRENCE DURING 721 BRK's MOT HISTORY
Advisory Faults | source www.vehiclestats.co.uk
Fault Fault Test Date Test Date/Time Reference MOT Test Reference
3 Welding has been carried out to the underside of the vehicle Welding has been carried out to the underside of the vehicle 25 October 2018 [10:49] 25/10/2018 17 October 2018 [10:09] 17/10/2018 21 September 2016 [11:17] 21/09/2016 336259096056 336259096056 685064532702 685064532702 738431032960 738431032960
2 Corrosion to the underside of the vehicle Corrosion to the underside of the vehicle 25 October 2018 [10:49] 25/10/2018 17 October 2018 [10:09] 17/10/2018 336259096056 336259096056 685064532702 685064532702
2 Oil leak, but not excessive (8.4.1 (a) (i)) Oil leak, but not excessive (8.4.1 (a) (i)) 25 October 2018 [10:49] 25/10/2018 17 October 2018 [10:09] 17/10/2018 336259096056 336259096056 685064532702 685064532702
2 Fuel pipe/s corroded () Fuel pipe/s corroded () 04 October 2017 [14:37] 04/10/2017 27 September 2017 [09:53] 27/09/2017 363682798312 363682798312 743913344347 743913344347
2 Oil leak () Oil leak () 04 October 2017 [14:37] 04/10/2017 27 September 2017 [09:53] 27/09/2017 363682798312 363682798312 743913344347 743913344347
1 Nearside rear service brake binding but not excessively (1.2.1 (f)) Nearside rear service brake binding but not excessively (1.2.1 (f)) 17 October 2018 [10:09] 17/10/2018 685064532702 685064532702
1 Fuel pipe slightly corroded Fuel pipe slightly corroded 07 September 2015 [13:22] 07/09/2015 524893353512 524893353512

ALL 721 BRK Failure Faults [26]

ALL Failure faults, ORDERED by OCCURRENCE DURING 721 BRK's MOT HISTORY
ALL 721 BRK Failure Faults [26]
ALL Failure faults, ORDERED by OCCURRENCE DURING 721 BRK's MOT HISTORY
Fail Faults | source www.vehiclestats.co.uk
Fault Fault Test Date Test Date/Time Reference MOT Test Reference
2 Parking brake: efficiency below requirements (3.7.b.7) Parking brake: efficiency below requirements (3.7.b.7) 27 September 2017 [09:53] 27/09/2017 28 August 2013 [16:13] 28/08/2013 743913344347 743913344347 405050243272 405050243272
2 Brakes imbalanced across an axle (3.7.b.5b) Brakes imbalanced across an axle (3.7.b.5b) 28 August 2013 [16:13] 28/08/2013 05 October 2005 [15:09] 05/10/2005 405050243272 405050243272 291378575210 291378575210
1 All position lamps not working (4.2.1 (a)) All position lamps not working (4.2.1 (a)) 17 October 2018 [10:09] 17/10/2018 685064532702 685064532702
1 Nearside headlamp not working on dipped beam (4.1.1 (a) (ii)) Nearside headlamp not working on dipped beam (4.1.1 (a) (ii)) 17 October 2018 [10:09] 17/10/2018 685064532702 685064532702
1 Offside headlamp not working on dipped beam (4.1.1 (a) (ii)) Offside headlamp not working on dipped beam (4.1.1 (a) (ii)) 17 October 2018 [10:09] 17/10/2018 685064532702 685064532702
1 Nearside headlamp not working on main beam (4.1.1 (a) (ii)) Nearside headlamp not working on main beam (4.1.1 (a) (ii)) 17 October 2018 [10:09] 17/10/2018 685064532702 685064532702
1 Offside headlamp not working on main beam (4.1.1 (a) (ii)) Offside headlamp not working on main beam (4.1.1 (a) (ii)) 17 October 2018 [10:09] 17/10/2018 685064532702 685064532702
1 Fuel cap/sealing device ineffective (6.1.3 (b) (i)) Fuel cap/sealing device ineffective (6.1.3 (b) (i)) 17 October 2018 [10:09] 17/10/2018 685064532702 685064532702
1 Nearside front integral body structure corroded to the extent that the rigidity of the assembly is significantly reduced inner door sill (6.1.1 (c) (i)) Nearside front integral body structure corroded to the extent that the rigidity of the assembly is significantly reduced inner door sill (6.1.1 (c) (i)) 17 October 2018 [10:09] 17/10/2018 685064532702 685064532702
1 Offside headlamp not working on dipped beam (1.7.5a) Offside headlamp not working on dipped beam (1.7.5a) 27 September 2017 [09:53] 27/09/2017 743913344347 743913344347
1 Nearside rear brake recording little or no effort (3.7.b.5a) Nearside rear brake recording little or no effort (3.7.b.5a) 27 September 2017 [09:53] 27/09/2017 743913344347 743913344347
1 Nearside rear parking brake recording little or no effort (3.7.b.6a) Nearside rear parking brake recording little or no effort (3.7.b.6a) 27 September 2017 [09:53] 27/09/2017 743913344347 743913344347
1 Rear brakes imbalanced across an axle axle 2 (3.7.b.5b) Rear brakes imbalanced across an axle axle 2 (3.7.b.5b) 27 September 2017 [09:53] 27/09/2017 743913344347 743913344347
1 Nearside rear tyre has a cut in excess of the requirements deep enough to reach the ply or cords (4.1.d.1a) Nearside rear tyre has a cut in excess of the requirements deep enough to reach the ply or cords (4.1.d.1a) 28 August 2013 [16:13] 28/08/2013 405050243272 405050243272
1 Brake pedal creeps down when held under pressure (3.3.b.1a) Brake pedal creeps down when held under pressure (3.3.b.1a) 28 August 2013 [16:13] 28/08/2013 405050243272 405050243272
1 Nearside front brake recording little or no effort (3.7.b.5a) Nearside front brake recording little or no effort (3.7.b.5a) 28 August 2013 [16:13] 28/08/2013 405050243272 405050243272
1 Offside front brake recording little or no effort (3.7.b.5a) Offside front brake recording little or no effort (3.7.b.5a) 28 August 2013 [16:13] 28/08/2013 405050243272 405050243272
1 Offside rear brake binding (3.7.b.1) Offside rear brake binding (3.7.b.1) 28 August 2013 [16:13] 28/08/2013 405050243272 405050243272
1 Nearside rear brake binding (3.7.b.1) Nearside rear brake binding (3.7.b.1) 28 August 2013 [16:13] 28/08/2013 405050243272 405050243272
1 Service brake: efficiency below requirements (3.7.b.7) Service brake: efficiency below requirements (3.7.b.7) 28 August 2013 [16:13] 28/08/2013 405050243272 405050243272
1 Offside rear suspension spring mounting prescribed area is excessively corroded (2.4.a.3) Offside rear suspension spring mounting prescribed area is excessively corroded (2.4.a.3) 05 October 2005 [15:09] 05/10/2005 291378575210 291378575210
1 Offside rear seat belt anchorage prescribed area is excessively corroded (5.2.6) Offside rear seat belt anchorage prescribed area is excessively corroded (5.2.6) 05 October 2005 [15:09] 05/10/2005 291378575210 291378575210
1 Nearside rear vehicle structure has excessive corrosion, seriously affecting its strength within 30cm of the body mountings (6.1.b.2) Nearside rear vehicle structure has excessive corrosion, seriously affecting its strength within 30cm of the body mountings (6.1.b.2) 05 October 2005 [15:09] 05/10/2005 291378575210 291378575210
1 Nearside front suspension arm has excessive play in a pin/bush (2.4.g.2) Nearside front suspension arm has excessive play in a pin/bush (2.4.g.2) 05 October 2005 [15:09] 05/10/2005 291378575210 291378575210

ALL 721 BRK User Entered Faults [1]

ALL User Entered faults, ORDERED by OCCURRENCE DURING 721 BRK's MOT HISTORY
ALL 721 BRK User Entered Faults [1]
ALL User Entered faults, ORDERED by OCCURRENCE DURING 721 BRK's MOT HISTORY
Fail Faults | source www.vehiclestats.co.uk
Fault Fault Test Date Test Date/Time Reference MOT Test Reference
1 Slight play in steering wheel top bush Slight play in steering wheel top bush 05 October 2005 [15:09] 05/10/2005 291378575210 291378575210

MOT TEST: 25 October 2018 10:49:12 PASSED
MOT TEST: 25 October 2018 10:49:12 PASSED

This test (336259096056) was completed on the 25 October 2018 10:49:12 and PASSED the requirements for a valid MOT with 3 comments.

This test (336259096056) was completed on the 25 October 2018 10:49:12 and PASSED the requirements for a valid MOT with 3 comments.

Recorded mileage: 68,029

Recorded mileage: 68,029


ADVISORY


MOT TEST: 17 October 2018 10:09:40 FAILED
MOT TEST: 17 October 2018 10:09:40 FAILED

This test (685064532702) was completed on the 17 October 2018 10:09:40 and FAILED the requirements for a valid MOT with 11 comments.

This test (685064532702) was completed on the 17 October 2018 10:09:40 and FAILED the requirements for a valid MOT with 11 comments.

Recorded mileage: 68,021

Recorded mileage: 68,021


ADVISORY

FAIL


MOT TEST: 04 October 2017 14:37:24 PASSED
MOT TEST: 04 October 2017 14:37:24 PASSED

This test (363682798312) was completed on the 04 October 2017 14:37:24 and PASSED the requirements for a valid MOT with 2 comments.

This test (363682798312) was completed on the 04 October 2017 14:37:24 and PASSED the requirements for a valid MOT with 2 comments.

Recorded mileage: 66,542

Recorded mileage: 66,542


ADVISORY


MOT TEST: 27 September 2017 09:53:40 FAILED
MOT TEST: 27 September 2017 09:53:40 FAILED

This test (743913344347) was completed on the 27 September 2017 09:53:40 and FAILED the requirements for a valid MOT with 7 comments.

This test (743913344347) was completed on the 27 September 2017 09:53:40 and FAILED the requirements for a valid MOT with 7 comments.

Recorded mileage: 66,534

Recorded mileage: 66,534


ADVISORY

FAIL


MOT TEST: 21 September 2016 11:17:26 PASSED
MOT TEST: 21 September 2016 11:17:26 PASSED

This test (738431032960) was completed on the 21 September 2016 11:17:26 and PASSED the requirements for a valid MOT with 1 comments.

This test (738431032960) was completed on the 21 September 2016 11:17:26 and PASSED the requirements for a valid MOT with 1 comments.

Recorded mileage: 65,357

Recorded mileage: 65,357


ADVISORY


MOT TEST: 07 September 2015 13:22:37 PASSED
MOT TEST: 07 September 2015 13:22:37 PASSED

This test (524893353512) was completed on the 07 September 2015 13:22:37 and PASSED the requirements for a valid MOT with 1 comments.

This test (524893353512) was completed on the 07 September 2015 13:22:37 and PASSED the requirements for a valid MOT with 1 comments.

Recorded mileage: 65,245

Recorded mileage: 65,245


ADVISORY


MOT TEST: 05 November 2013 12:53:17 PASSED
MOT TEST: 05 November 2013 12:53:17 PASSED

This test (987009103362) was completed on the 05 November 2013 12:53:17 and PASSED the requirements for a valid MOT with 0 comments.

This test (987009103362) was completed on the 05 November 2013 12:53:17 and PASSED the requirements for a valid MOT with 0 comments.

Recorded mileage: 65,198

Recorded mileage: 65,198


MOT TEST: 28 August 2013 16:13:50 FAILED
MOT TEST: 28 August 2013 16:13:50 FAILED

This test (405050243272) was completed on the 28 August 2013 16:13:50 and FAILED the requirements for a valid MOT with 9 comments.

This test (405050243272) was completed on the 28 August 2013 16:13:50 and FAILED the requirements for a valid MOT with 9 comments.

Recorded mileage: 65,197

Recorded mileage: 65,197


FAIL


MOT TEST: 02 December 2006 12:02:11 PASSED
MOT TEST: 02 December 2006 12:02:11 PASSED

This test (743346436323) was completed on the 02 December 2006 12:02:11 and PASSED the requirements for a valid MOT with 0 comments.

This test (743346436323) was completed on the 02 December 2006 12:02:11 and PASSED the requirements for a valid MOT with 0 comments.

Recorded mileage: 65,126

Recorded mileage: 65,126


MOT TEST: 18 October 2005 14:07:51 PASSED
MOT TEST: 18 October 2005 14:07:51 PASSED

This test (560941795233) was completed on the 18 October 2005 14:07:51 and PASSED the requirements for a valid MOT with 0 comments.

This test (560941795233) was completed on the 18 October 2005 14:07:51 and PASSED the requirements for a valid MOT with 0 comments.

Recorded mileage: 65,005

Recorded mileage: 65,005


MOT TEST: 05 October 2005 15:09:10 FAILED
MOT TEST: 05 October 2005 15:09:10 FAILED

This test (291378575210) was completed on the 05 October 2005 15:09:10 and FAILED the requirements for a valid MOT with 6 comments.

This test (291378575210) was completed on the 05 October 2005 15:09:10 and FAILED the requirements for a valid MOT with 6 comments.

Recorded mileage: 65,005

Recorded mileage: 65,005


FAIL

USER ENTERED