721 TYA


721TYA is registered to a Grey 1963, Morris Minor with a Petrol engine. It Passed its most recent MOT Test on the 13 June 2018

39 unique faults (47 Total) reported in its MOT History (18 Tests).

5 common/recurring faults, the most frequent (3 times) is: Oil leak.

72% (13) MOT Pass Rate and a 28% (5) MOT Failure Rate.

23,369 recorded miles.

721 TYA


721TYA is registered to a Grey 1963, Morris Minor with a Petrol engine. It Passed its most recent MOT Test on the 13 June 2018

39 unique faults (47 Total) reported in its MOT History (18 Tests).

5 common/recurring faults, the most frequent (3 times) is: Oil leak.

72% (13) MOT Pass Rate and a 28% (5) MOT Failure Rate.

23,369 recorded miles.

MOT PASS/Failure rate for 721 TYA

all MOT test results for 721 TYA represented as a percentage
MOT PASS/Failure rate for 721 TYA
all MOT test results for 721 TYA represented as a percentage

PERCENTAGE OF VEHICLE FAULTS WITH 721 TYA

ALL REPORTED FAULTS, DISPLAYED BY PERCENTAGE OF OCCURRENCE DURING ALL MOT TESTS
PERCENTAGE OF VEHICLE FAULTS WITH 721 TYA
ALL REPORTED FAULTS, DISPLAYED BY PERCENTAGE OF OCCURRENCE DURING ALL MOT TESTS
ADVISORY

FAIL

USER ENTERED

721 TYA annual Faults by type

ALL REPORTED FAULTS, DISPLAYED over time and categorised by type
721 TYA annual Faults by type
ALL REPORTED FAULTS, DISPLAYED over time and categorised by type

RECURRING FAULTS WITH 721 TYA

FAULTS THAT HAVE OCCURED MORE THAN ONCE DURING 721 TYA's MOT HISTORY
RECURRING FAULTS WITH 721 TYA
FAULTS THAT HAVE OCCURED MORE THAN ONCE DURING 721 TYA's MOT HISTORY
Fault Fault Test Date Test Date/Time Reference MOT Test Reference
3 Oil leak Oil leak 28 March 2014 [13:10] 28/03/2014 26 March 2014 [12:32] 26/03/2014 25 March 2013 [13:33] 25/03/2013 187307184483 187307184483 905355384040 905355384040 517534083026 517534083026
3 Brakes imbalanced across an axle (3.7.b.5b) Brakes imbalanced across an axle (3.7.b.5b) 26 March 2014 [12:32] 26/03/2014 18 January 2011 [12:33] 18/01/2011 27 July 2007 [10:06] 27/07/2007 905355384040 905355384040 165088011404 165088011404 844008407254 844008407254
2 All tyres have minor cracking. All tyres have minor cracking. 28 March 2014 [13:10] 28/03/2014 26 March 2014 [12:32] 26/03/2014 187307184483 187307184483 905355384040 905355384040
2 O/s front tyre inner tread wearing down. O/s front tyre inner tread wearing down. 28 March 2014 [13:10] 28/03/2014 26 March 2014 [12:32] 26/03/2014 187307184483 187307184483 905355384040 905355384040
2 Nearside front wheel bearing has slight play (2.5.a.3c) Nearside front wheel bearing has slight play (2.5.a.3c) 27 July 2007 [10:06] 27/07/2007 27 July 2006 [11:56] 27/07/2006 844008407254 844008407254 603478806279 603478806279

ALL 721 TYA ADVISORIES [4]

ALL ADVISORIES, ORDERED by OCCURRENCE DURING 721 TYA's MOT HISTORY
ALL 721 TYA ADVISORIES [4]
ALL ADVISORIES, ORDERED by OCCURRENCE DURING 721 TYA's MOT HISTORY
Fail Faults | source www.vehiclestats.co.uk
Fault Fault Test Date Test Date/Time Reference MOT Test Reference
2 Nearside front wheel bearing has slight play (2.5.a.3c) Nearside front wheel bearing has slight play (2.5.a.3c) 27 July 2007 [10:06] 27/07/2007 27 July 2006 [11:56] 27/07/2006 844008407254 844008407254 603478806279 603478806279
1 Offside front wheel bearing has slight play (2.5.a.3c) Offside front wheel bearing has slight play (2.5.a.3c) 27 July 2006 [11:56] 27/07/2006 603478806279 603478806279
1 Nearside front tyre worn close to the legal limit (4.1.e.1) Nearside front tyre worn close to the legal limit (4.1.e.1) 27 July 2006 [11:56] 27/07/2006 603478806279 603478806279

ALL 721 TYA Failure Faults [31]

ALL Failure faults, ORDERED by OCCURRENCE DURING 721 TYA's MOT HISTORY
ALL 721 TYA Failure Faults [31]
ALL Failure faults, ORDERED by OCCURRENCE DURING 721 TYA's MOT HISTORY
Fail Faults | source www.vehiclestats.co.uk
Fault Fault Test Date Test Date/Time Reference MOT Test Reference
3 Brakes imbalanced across an axle (3.7.b.5b) Brakes imbalanced across an axle (3.7.b.5b) 26 March 2014 [12:32] 26/03/2014 18 January 2011 [12:33] 18/01/2011 27 July 2007 [10:06] 27/07/2007 905355384040 905355384040 165088011404 165088011404 844008407254 844008407254
1 Nearside rear mechanical brake component has restricted free movement (3.5.1k) Nearside rear mechanical brake component has restricted free movement (3.5.1k) 26 March 2014 [12:32] 26/03/2014 905355384040 905355384040
1 Nearside headlamp aim too low (1.8) Nearside headlamp aim too low (1.8) 18 January 2011 [12:33] 18/01/2011 165088011404 165088011404
1 Offside front upper suspension arm has excessive play in a pin/bearing (2.4.g.2) Offside front upper suspension arm has excessive play in a pin/bearing (2.4.g.2) 18 January 2011 [12:33] 18/01/2011 165088011404 165088011404
1 Nearside front upper suspension arm has excessive play in a pin/bearing (2.4.g.2) Nearside front upper suspension arm has excessive play in a pin/bearing (2.4.g.2) 18 January 2011 [12:33] 18/01/2011 165088011404 165088011404
1 Nearside front lower suspension arm has excessive play in a pin/bearing (2.4.g.2) Nearside front lower suspension arm has excessive play in a pin/bearing (2.4.g.2) 18 January 2011 [12:33] 18/01/2011 165088011404 165088011404
1 Brake pedal spongy (3.3.b.1b) Brake pedal spongy (3.3.b.1b) 18 January 2011 [12:33] 18/01/2011 165088011404 165088011404
1 Brake pedal has no servo assistance (3.3.b.2) Brake pedal has no servo assistance (3.3.b.2) 18 January 2011 [12:33] 18/01/2011 165088011404 165088011404
1 Nearside front braking system leaking (3.6.a.1) Nearside front braking system leaking (3.6.a.1) 18 January 2011 [12:33] 18/01/2011 165088011404 165088011404
1 Offside front braking system leaking (3.6.a.1) Offside front braking system leaking (3.6.a.1) 18 January 2011 [12:33] 18/01/2011 165088011404 165088011404
1 Offside steering rack gaiter split (2.2.d.2d) Offside steering rack gaiter split (2.2.d.2d) 07 August 2010 [09:44] 07/08/2010 702129310269 702129310269
1 Front windscreen wiper does not clear the windscreen effectively (8.2.2) Front windscreen wiper does not clear the windscreen effectively (8.2.2) 13 June 2008 [15:04] 13/06/2008 843275168169 843275168169
1 Front passenger door cannot be opened from outside the vehicle (6.2.b.1b) Front passenger door cannot be opened from outside the vehicle (6.2.b.1b) 13 June 2008 [15:04] 13/06/2008 843275168169 843275168169
1 Offside rear suspension spring mounting prescribed area is excessively corroded (2.4.a.3) Offside rear suspension spring mounting prescribed area is excessively corroded (2.4.a.3) 13 June 2008 [15:04] 13/06/2008 843275168169 843275168169
1 Nearside front shock absorber has a serious fluid leak (2.7.3) Nearside front shock absorber has a serious fluid leak (2.7.3) 13 June 2008 [15:04] 13/06/2008 843275168169 843275168169
1 Nearside rear brake binding (3.7.b.1) Nearside rear brake binding (3.7.b.1) 13 June 2008 [15:04] 13/06/2008 843275168169 843275168169
1 Rear stop lamp not working (1.2.1b) Rear stop lamp not working (1.2.1b) 13 June 2008 [15:04] 13/06/2008 843275168169 843275168169
1 Front brake application uneven (3.7.b.2) Front brake application uneven (3.7.b.2) 27 July 2007 [10:06] 27/07/2007 844008407254 844008407254
1 Front windscreen washer provides insufficient washer liquid (8.2.3) Front windscreen washer provides insufficient washer liquid (8.2.3) 27 July 2007 [10:06] 27/07/2007 844008407254 844008407254
1 Horn not working (1.6.2a) Horn not working (1.6.2a) 27 July 2007 [10:06] 27/07/2007 844008407254 844008407254
1 Indicator switch insecure (1.4.a.1) Indicator switch insecure (1.4.a.1) 27 July 2007 [10:06] 27/07/2007 844008407254 844008407254
1 Front exhaust has a major leak of exhaust gases (7.1.2) Front exhaust has a major leak of exhaust gases (7.1.2) 27 July 2007 [10:06] 27/07/2007 844008407254 844008407254
1 Front exhaust has part of the system excessively deteriorated (7.1.1a) Front exhaust has part of the system excessively deteriorated (7.1.1a) 27 July 2007 [10:06] 27/07/2007 844008407254 844008407254
1 Nearside rear suspension spring mounting prescribed area is excessively corroded (2.4.a.3) Nearside rear suspension spring mounting prescribed area is excessively corroded (2.4.a.3) 27 July 2007 [10:06] 27/07/2007 844008407254 844008407254
1 Offside front front wheel bearing has excessive play (2.5.a.3c) Offside front front wheel bearing has excessive play (2.5.a.3c) 27 July 2007 [10:06] 27/07/2007 844008407254 844008407254
1 Nearside front tyre tread depth below requirements of 1.6mm (4.1.e.1) Nearside front tyre tread depth below requirements of 1.6mm (4.1.e.1) 27 July 2007 [10:06] 27/07/2007 844008407254 844008407254
1 Nearside front suspension has excessive play in a upper suspension ball joint (2.5.b.1a) Nearside front suspension has excessive play in a upper suspension ball joint (2.5.b.1a) 27 July 2007 [10:06] 27/07/2007 844008407254 844008407254
1 Nearside front suspension has excessive play in a lower suspension ball joint (2.5.b.1a) Nearside front suspension has excessive play in a lower suspension ball joint (2.5.b.1a) 27 July 2007 [10:06] 27/07/2007 844008407254 844008407254

ALL 721 TYA User Entered Faults [12]

ALL User Entered faults, ORDERED by OCCURRENCE DURING 721 TYA's MOT HISTORY
ALL 721 TYA User Entered Faults [12]
ALL User Entered faults, ORDERED by OCCURRENCE DURING 721 TYA's MOT HISTORY
User Entered Faults | source www.vehiclestats.co.uk
Fault Fault Test Date Test Date/Time Reference MOT Test Reference
3 Oil leak Oil leak 28 March 2014 [13:10] 28/03/2014 26 March 2014 [12:32] 26/03/2014 25 March 2013 [13:33] 25/03/2013 187307184483 187307184483 905355384040 905355384040 517534083026 517534083026
2 All tyres have minor cracking. All tyres have minor cracking. 28 March 2014 [13:10] 28/03/2014 26 March 2014 [12:32] 26/03/2014 187307184483 187307184483 905355384040 905355384040
2 O/s front tyre inner tread wearing down. O/s front tyre inner tread wearing down. 28 March 2014 [13:10] 28/03/2014 26 March 2014 [12:32] 26/03/2014 187307184483 187307184483 905355384040 905355384040
1 Slight natural undulations on o/s and n/s front tyre sidewalls. Slight natural undulations on o/s and n/s front tyre sidewalls. 25 March 2013 [13:33] 25/03/2013 517534083026 517534083026
1 O/s front tyre inner tread getting low,light cracking o/s rear and n/s rear tyre sidewalls. O/s front tyre inner tread getting low,light cracking o/s rear and n/s rear tyre sidewalls. 28 March 2012 [12:20] 28/03/2012 489068082032 489068082032
1 N/s/f door not latching correctly N/s/f door not latching correctly 18 January 2011 [12:33] 18/01/2011 165088011404 165088011404
1 All floors corroded slight All floors corroded slight 13 June 2008 [15:04] 13/06/2008 843275168169 843275168169
1 Front brakes have slight imbalance Front brakes have slight imbalance 27 July 2006 [11:56] 27/07/2006 603478806279 603478806279

MOT TEST: 13 June 2018 09:49:00 PASSED
MOT TEST: 13 June 2018 09:49:00 PASSED

This test (180023694858) was completed on the 13 June 2018 09:49:00 and PASSED the requirements for a valid MOT with 0 comments.

This test (180023694858) was completed on the 13 June 2018 09:49:00 and PASSED the requirements for a valid MOT with 0 comments.

Recorded mileage: 23,369

Recorded mileage: 23,369


MOT TEST: 21 March 2017 10:36:56 PASSED
MOT TEST: 21 March 2017 10:36:56 PASSED

This test (479728858059) was completed on the 21 March 2017 10:36:56 and PASSED the requirements for a valid MOT with 0 comments.

This test (479728858059) was completed on the 21 March 2017 10:36:56 and PASSED the requirements for a valid MOT with 0 comments.

Recorded mileage: 23,358

Recorded mileage: 23,358


MOT TEST: 21 March 2016 11:41:59 PASSED
MOT TEST: 21 March 2016 11:41:59 PASSED

This test (200162460315) was completed on the 21 March 2016 11:41:59 and PASSED the requirements for a valid MOT with 0 comments.

This test (200162460315) was completed on the 21 March 2016 11:41:59 and PASSED the requirements for a valid MOT with 0 comments.

Recorded mileage: 23,355

Recorded mileage: 23,355


MOT TEST: 26 March 2015 09:46:05 PASSED
MOT TEST: 26 March 2015 09:46:05 PASSED

This test (385005485002) was completed on the 26 March 2015 09:46:05 and PASSED the requirements for a valid MOT with 0 comments.

This test (385005485002) was completed on the 26 March 2015 09:46:05 and PASSED the requirements for a valid MOT with 0 comments.

Recorded mileage: 23,250

Recorded mileage: 23,250


MOT TEST: 28 March 2014 13:10:44 PASSED
MOT TEST: 28 March 2014 13:10:44 PASSED

This test (187307184483) was completed on the 28 March 2014 13:10:44 and PASSED the requirements for a valid MOT with 3 comments.

This test (187307184483) was completed on the 28 March 2014 13:10:44 and PASSED the requirements for a valid MOT with 3 comments.

Recorded mileage: 22,510

Recorded mileage: 22,510


USER ENTERED


MOT TEST: 26 March 2014 12:32:54 FAILED
MOT TEST: 26 March 2014 12:32:54 FAILED

This test (905355384040) was completed on the 26 March 2014 12:32:54 and FAILED the requirements for a valid MOT with 5 comments.

This test (905355384040) was completed on the 26 March 2014 12:32:54 and FAILED the requirements for a valid MOT with 5 comments.

Recorded mileage: 22,510

Recorded mileage: 22,510


FAIL

USER ENTERED


MOT TEST: 25 March 2013 13:33:37 PASSED
MOT TEST: 25 March 2013 13:33:37 PASSED

This test (517534083026) was completed on the 25 March 2013 13:33:37 and PASSED the requirements for a valid MOT with 2 comments.

This test (517534083026) was completed on the 25 March 2013 13:33:37 and PASSED the requirements for a valid MOT with 2 comments.

Recorded mileage: 22,276

Recorded mileage: 22,276


USER ENTERED


MOT TEST: 28 March 2012 12:20:32 PASSED
MOT TEST: 28 March 2012 12:20:32 PASSED

This test (489068082032) was completed on the 28 March 2012 12:20:32 and PASSED the requirements for a valid MOT with 1 comments.

This test (489068082032) was completed on the 28 March 2012 12:20:32 and PASSED the requirements for a valid MOT with 1 comments.

Recorded mileage: 22,180

Recorded mileage: 22,180


USER ENTERED


MOT TEST: 28 January 2011 12:59:08 PASSED
MOT TEST: 28 January 2011 12:59:08 PASSED

This test (645038221007) was completed on the 28 January 2011 12:59:08 and PASSED the requirements for a valid MOT with 0 comments.

This test (645038221007) was completed on the 28 January 2011 12:59:08 and PASSED the requirements for a valid MOT with 0 comments.

Recorded mileage: 21,386

Recorded mileage: 21,386


MOT TEST: 18 January 2011 12:33:15 FAILED
MOT TEST: 18 January 2011 12:33:15 FAILED

This test (165088011404) was completed on the 18 January 2011 12:33:15 and FAILED the requirements for a valid MOT with 10 comments.

This test (165088011404) was completed on the 18 January 2011 12:33:15 and FAILED the requirements for a valid MOT with 10 comments.

Recorded mileage: 21,362

Recorded mileage: 21,362


FAIL

USER ENTERED


MOT TEST: 07 August 2010 11:56:23 PASSED
MOT TEST: 07 August 2010 11:56:23 PASSED

This test (171019910230) was completed on the 07 August 2010 11:56:23 and PASSED the requirements for a valid MOT with 0 comments.

This test (171019910230) was completed on the 07 August 2010 11:56:23 and PASSED the requirements for a valid MOT with 0 comments.

Recorded mileage: 20,557

Recorded mileage: 20,557


MOT TEST: 07 August 2010 09:44:36 FAILED
MOT TEST: 07 August 2010 09:44:36 FAILED

This test (702129310269) was completed on the 07 August 2010 09:44:36 and FAILED the requirements for a valid MOT with 1 comments.

This test (702129310269) was completed on the 07 August 2010 09:44:36 and FAILED the requirements for a valid MOT with 1 comments.

Recorded mileage: 20,557

Recorded mileage: 20,557


FAIL


MOT TEST: 03 September 2009 15:41:28 PASSED
MOT TEST: 03 September 2009 15:41:28 PASSED

This test (271586049251) was completed on the 03 September 2009 15:41:28 and PASSED the requirements for a valid MOT with 0 comments.

This test (271586049251) was completed on the 03 September 2009 15:41:28 and PASSED the requirements for a valid MOT with 0 comments.

Recorded mileage: 18,857

Recorded mileage: 18,857


MOT TEST: 24 June 2008 11:51:38 PASSED
MOT TEST: 24 June 2008 11:51:38 PASSED

This test (491906878194) was completed on the 24 June 2008 11:51:38 and PASSED the requirements for a valid MOT with 0 comments.

This test (491906878194) was completed on the 24 June 2008 11:51:38 and PASSED the requirements for a valid MOT with 0 comments.

Recorded mileage: 16,413

Recorded mileage: 16,413


MOT TEST: 13 June 2008 15:04:42 FAILED
MOT TEST: 13 June 2008 15:04:42 FAILED

This test (843275168169) was completed on the 13 June 2008 15:04:42 and FAILED the requirements for a valid MOT with 7 comments.

This test (843275168169) was completed on the 13 June 2008 15:04:42 and FAILED the requirements for a valid MOT with 7 comments.

Recorded mileage: 16,411

Recorded mileage: 16,411


FAIL

USER ENTERED


MOT TEST: 03 August 2007 14:00:57 PASSED
MOT TEST: 03 August 2007 14:00:57 PASSED

This test (203375617255) was completed on the 03 August 2007 14:00:57 and PASSED the requirements for a valid MOT with 0 comments.

This test (203375617255) was completed on the 03 August 2007 14:00:57 and PASSED the requirements for a valid MOT with 0 comments.

Recorded mileage: 15,844

Recorded mileage: 15,844


MOT TEST: 27 July 2007 10:06:01 FAILED
MOT TEST: 27 July 2007 10:06:01 FAILED

This test (844008407254) was completed on the 27 July 2007 10:06:01 and FAILED the requirements for a valid MOT with 14 comments.

This test (844008407254) was completed on the 27 July 2007 10:06:01 and FAILED the requirements for a valid MOT with 14 comments.

Recorded mileage: 15,830

Recorded mileage: 15,830


ADVISORY

FAIL


MOT TEST: 27 July 2006 11:56:25 PASSED
MOT TEST: 27 July 2006 11:56:25 PASSED

This test (603478806279) was completed on the 27 July 2006 11:56:25 and PASSED the requirements for a valid MOT with 4 comments.

This test (603478806279) was completed on the 27 July 2006 11:56:25 and PASSED the requirements for a valid MOT with 4 comments.

Recorded mileage: 14,282

Recorded mileage: 14,282


ADVISORY

USER ENTERED