723 UXE


723UXE is registered to a White 1971, Morris Minor with a Petrol engine. It Failed its most recent MOT Test on the 27 August 2010

33 unique faults (37 Total) reported in its MOT History (8 Tests).

3 common/recurring faults, the most frequent (3 times) is: all tyres perished.

38% (3) MOT Pass Rate and a 62% (5) MOT Failure Rate.

6,494 recorded miles.

723 UXE


723UXE is registered to a White 1971, Morris Minor with a Petrol engine. It Failed its most recent MOT Test on the 27 August 2010

33 unique faults (37 Total) reported in its MOT History (8 Tests).

3 common/recurring faults, the most frequent (3 times) is: all tyres perished.

38% (3) MOT Pass Rate and a 62% (5) MOT Failure Rate.

6,494 recorded miles.

MOT PASS/Failure rate for 723 UXE

all MOT test results for 723 UXE represented as a percentage
MOT PASS/Failure rate for 723 UXE
all MOT test results for 723 UXE represented as a percentage

PERCENTAGE OF VEHICLE FAULTS WITH 723 UXE

ALL REPORTED FAULTS, DISPLAYED BY PERCENTAGE OF OCCURRENCE DURING ALL MOT TESTS
PERCENTAGE OF VEHICLE FAULTS WITH 723 UXE
ALL REPORTED FAULTS, DISPLAYED BY PERCENTAGE OF OCCURRENCE DURING ALL MOT TESTS
ADVISORY

FAIL

USER ENTERED

723 UXE annual Faults by type

ALL REPORTED FAULTS, DISPLAYED over time and categorised by type
723 UXE annual Faults by type
ALL REPORTED FAULTS, DISPLAYED over time and categorised by type

RECURRING FAULTS WITH 723 UXE

FAULTS THAT HAVE OCCURED MORE THAN ONCE DURING 723 UXE's MOT HISTORY
RECURRING FAULTS WITH 723 UXE
FAULTS THAT HAVE OCCURED MORE THAN ONCE DURING 723 UXE's MOT HISTORY
Fault Fault Test Date Test Date/Time Reference MOT Test Reference
3 All tyres perished All tyres perished 27 August 2010 [13:50] 27/08/2010 07 August 2009 [17:13] 07/08/2009 03 June 2009 [13:59] 03/06/2009 850229630221 850229630221 952199719237 952199719237 353004659193 353004659193
2 Offside front tyre worn close to the legal limit (4.1.e.1) Offside front tyre worn close to the legal limit (4.1.e.1) 07 August 2009 [17:13] 07/08/2009 03 June 2009 [13:59] 03/06/2009 952199719237 952199719237 353004659193 353004659193
2 Nearside front wheel arch corroded Nearside front wheel arch corroded 07 August 2009 [17:13] 07/08/2009 03 June 2009 [13:59] 03/06/2009 952199719237 952199719237 353004659193 353004659193

ALL 723 UXE ADVISORIES [3]

ALL ADVISORIES, ORDERED by OCCURRENCE DURING 723 UXE's MOT HISTORY
ALL 723 UXE ADVISORIES [3]
ALL ADVISORIES, ORDERED by OCCURRENCE DURING 723 UXE's MOT HISTORY
Fail Faults | source www.vehiclestats.co.uk
Fault Fault Test Date Test Date/Time Reference MOT Test Reference
2 Offside front tyre worn close to the legal limit (4.1.e.1) Offside front tyre worn close to the legal limit (4.1.e.1) 07 August 2009 [17:13] 07/08/2009 03 June 2009 [13:59] 03/06/2009 952199719237 952199719237 353004659193 353004659193
1 Offside front wheel bearing has slight play (2.5.a.3c) Offside front wheel bearing has slight play (2.5.a.3c) 27 August 2010 [13:50] 27/08/2010 850229630221 850229630221

ALL 723 UXE Failure Faults [25]

ALL Failure faults, ORDERED by OCCURRENCE DURING 723 UXE's MOT HISTORY
ALL 723 UXE Failure Faults [25]
ALL Failure faults, ORDERED by OCCURRENCE DURING 723 UXE's MOT HISTORY
Fail Faults | source www.vehiclestats.co.uk
Fault Fault Test Date Test Date/Time Reference MOT Test Reference
1 Horn not working (1.6.2a) Horn not working (1.6.2a) 27 August 2010 [13:50] 27/08/2010 850229630221 850229630221
1 Headlamp not working on main beam (1.7.5a) Headlamp not working on main beam (1.7.5a) 27 August 2010 [13:50] 27/08/2010 850229630221 850229630221
1 Windscreen washer provides insufficient washer liquid (8.2.3) Windscreen washer provides insufficient washer liquid (8.2.3) 27 August 2010 [13:50] 27/08/2010 850229630221 850229630221
1 Registration plate lamp not working (1.1.c.1d) Registration plate lamp not working (1.1.c.1d) 27 August 2010 [13:50] 27/08/2010 850229630221 850229630221
1 Offside front tyre tread depth below requirements of 1.6mm (4.1.e.1) Offside front tyre tread depth below requirements of 1.6mm (4.1.e.1) 27 August 2010 [13:50] 27/08/2010 850229630221 850229630221
1 Offside seat belt anchorage prescribed area is excessively corroded (5.2.6) Offside seat belt anchorage prescribed area is excessively corroded (5.2.6) 27 August 2010 [13:50] 27/08/2010 850229630221 850229630221
1 Nearside seat belt anchorage prescribed area is excessively corroded (5.2.6) Nearside seat belt anchorage prescribed area is excessively corroded (5.2.6) 27 August 2010 [13:50] 27/08/2010 850229630221 850229630221
1 Nearside rear torque/reaction arm attachment bracket/mounting nut missing (2.4.g.1) Nearside rear torque/reaction arm attachment bracket/mounting nut missing (2.4.g.1) 27 August 2010 [13:50] 27/08/2010 850229630221 850229630221
1 Brakes imbalanced across an axle (3.7.b.5b) Brakes imbalanced across an axle (3.7.b.5b) 27 August 2010 [13:50] 27/08/2010 850229630221 850229630221
1 Nearside rear brake recording little or no effort (3.7.b.5a) Nearside rear brake recording little or no effort (3.7.b.5a) 27 August 2010 [13:50] 27/08/2010 850229630221 850229630221
1 Nearside rear parking brake recording little or no effort (3.7.b.6a) Nearside rear parking brake recording little or no effort (3.7.b.6a) 27 August 2010 [13:50] 27/08/2010 850229630221 850229630221
1 Offside front position lamp(s) not working (1.1.a.3b) Offside front position lamp(s) not working (1.1.a.3b) 07 August 2009 [17:13] 07/08/2009 952199719237 952199719237
1 Registration plate lamp not working (1.1.5c) Registration plate lamp not working (1.1.5c) 03 June 2009 [13:59] 03/06/2009 353004659193 353004659193
1 Stop lamp not working (1.2.1b) Stop lamp not working (1.2.1b) 03 June 2009 [13:59] 03/06/2009 353004659193 353004659193
1 Nearside rear seat belt anchorage prescribed area is excessively corroded (5.2.6) Nearside rear seat belt anchorage prescribed area is excessively corroded (5.2.6) 03 June 2009 [13:59] 03/06/2009 353004659193 353004659193
1 Indicator tell tale inoperative (1.4.a.2a) Indicator tell tale inoperative (1.4.a.2a) 04 April 2008 [14:55] 04/04/2008 122545098439 122545098439
1 Nearside track rod end loose (2.2.b.1d) Nearside track rod end loose (2.2.b.1d) 04 April 2008 [14:55] 04/04/2008 122545098439 122545098439
1 Nearside rear suspension spring mounting prescribed area is excessively corroded (2.4.a.3) Nearside rear suspension spring mounting prescribed area is excessively corroded (2.4.a.3) 04 April 2008 [14:55] 04/04/2008 122545098439 122545098439
1 Parking brake: efficiency below requirements (3.7.b.7) Parking brake: efficiency below requirements (3.7.b.7) 04 April 2008 [14:55] 04/04/2008 122545098439 122545098439
1 Nearside headlamp not working on dipped beam (1.7.5a) Nearside headlamp not working on dipped beam (1.7.5a) 12 March 2007 [16:32] 12/03/2007 380111877000 380111877000
1 Nearside headlamp not working on main beam (1.7.5a) Nearside headlamp not working on main beam (1.7.5a) 12 March 2007 [16:32] 12/03/2007 380111877000 380111877000
1 Offside headlamp aim too high (1.8) Offside headlamp aim too high (1.8) 12 March 2007 [16:32] 12/03/2007 380111877000 380111877000
1 Nearside rear braking system leaking (3.6.a.1) Nearside rear braking system leaking (3.6.a.1) 12 March 2007 [16:32] 12/03/2007 380111877000 380111877000
1 Nearside front brake recording little or no effort (3.7.b.5a) Nearside front brake recording little or no effort (3.7.b.5a) 12 March 2007 [16:32] 12/03/2007 380111877000 380111877000
1 Nearside rear vehicle structure has excessive corrosion which adversely affects braking or steering (6.1.a.1) Nearside rear vehicle structure has excessive corrosion which adversely affects braking or steering (6.1.a.1) 12 March 2007 [16:32] 12/03/2007 380111877000 380111877000

ALL 723 UXE User Entered Faults [9]

ALL User Entered faults, ORDERED by OCCURRENCE DURING 723 UXE's MOT HISTORY
ALL 723 UXE User Entered Faults [9]
ALL User Entered faults, ORDERED by OCCURRENCE DURING 723 UXE's MOT HISTORY
Fail Faults | source www.vehiclestats.co.uk
Fault Fault Test Date Test Date/Time Reference MOT Test Reference
3 All tyres perished All tyres perished 27 August 2010 [13:50] 27/08/2010 07 August 2009 [17:13] 07/08/2009 03 June 2009 [13:59] 03/06/2009 850229630221 850229630221 952199719237 952199719237 353004659193 353004659193
2 Nearside front wheel arch corroded Nearside front wheel arch corroded 07 August 2009 [17:13] 07/08/2009 03 June 2009 [13:59] 03/06/2009 952199719237 952199719237 353004659193 353004659193
1 Engine smoking Engine smoking 27 August 2010 [13:50] 27/08/2010 850229630221 850229630221
1 Offside front floor & sill corroded Offside front floor & sill corroded 27 August 2010 [13:50] 27/08/2010 850229630221 850229630221
1 Centre cross member corroded Centre cross member corroded 04 April 2008 [14:55] 04/04/2008 122545098439 122545098439
1 Nearside floor to sill corroded Nearside floor to sill corroded 04 April 2008 [14:55] 04/04/2008 122545098439 122545098439

MOT TEST: 27 August 2010 13:50:56 FAILED
MOT TEST: 27 August 2010 13:50:56 FAILED

This test (850229630221) was completed on the 27 August 2010 13:50:56 and FAILED the requirements for a valid MOT with 15 comments.

This test (850229630221) was completed on the 27 August 2010 13:50:56 and FAILED the requirements for a valid MOT with 15 comments.

Recorded mileage: 6,494

Recorded mileage: 6,494


ADVISORY

FAIL

USER ENTERED


MOT TEST: 07 August 2009 17:13:18 FAILED
MOT TEST: 07 August 2009 17:13:18 FAILED

This test (952199719237) was completed on the 07 August 2009 17:13:18 and FAILED the requirements for a valid MOT with 4 comments.

This test (952199719237) was completed on the 07 August 2009 17:13:18 and FAILED the requirements for a valid MOT with 4 comments.

Recorded mileage: 3,983

Recorded mileage: 3,983


ADVISORY

FAIL

USER ENTERED


MOT TEST: 03 June 2009 13:59:54 FAILED
MOT TEST: 03 June 2009 13:59:54 FAILED

This test (353004659193) was completed on the 03 June 2009 13:59:54 and FAILED the requirements for a valid MOT with 6 comments.

This test (353004659193) was completed on the 03 June 2009 13:59:54 and FAILED the requirements for a valid MOT with 6 comments.

Recorded mileage: 3,969

Recorded mileage: 3,969


ADVISORY

FAIL

USER ENTERED


MOT TEST: 02 May 2008 12:02:39 PASSED
MOT TEST: 02 May 2008 12:02:39 PASSED

This test (232703828104) was completed on the 02 May 2008 12:02:39 and PASSED the requirements for a valid MOT with 0 comments.

This test (232703828104) was completed on the 02 May 2008 12:02:39 and PASSED the requirements for a valid MOT with 0 comments.

Recorded mileage: 2,668

Recorded mileage: 2,668


MOT TEST: 04 April 2008 14:55:34 FAILED
MOT TEST: 04 April 2008 14:55:34 FAILED

This test (122545098439) was completed on the 04 April 2008 14:55:34 and FAILED the requirements for a valid MOT with 6 comments.

This test (122545098439) was completed on the 04 April 2008 14:55:34 and FAILED the requirements for a valid MOT with 6 comments.

Recorded mileage: 2,659

Recorded mileage: 2,659


FAIL

USER ENTERED


MOT TEST: 12 April 2007 15:36:10 PASSED
MOT TEST: 12 April 2007 15:36:10 PASSED

This test (124032907150) was completed on the 12 April 2007 15:36:10 and PASSED the requirements for a valid MOT with 0 comments.

This test (124032907150) was completed on the 12 April 2007 15:36:10 and PASSED the requirements for a valid MOT with 0 comments.

Recorded mileage: 84

Recorded mileage: 84


MOT TEST: 12 March 2007 16:32:34 FAILED
MOT TEST: 12 March 2007 16:32:34 FAILED

This test (380111877000) was completed on the 12 March 2007 16:32:34 and FAILED the requirements for a valid MOT with 6 comments.

This test (380111877000) was completed on the 12 March 2007 16:32:34 and FAILED the requirements for a valid MOT with 6 comments.

Recorded mileage: 75

Recorded mileage: 75


FAIL


MOT TEST: 15 August 2006 16:51:44 PASSED
MOT TEST: 15 August 2006 16:51:44 PASSED

This test (133227526281) was completed on the 15 August 2006 16:51:44 and PASSED the requirements for a valid MOT with 0 comments.

This test (133227526281) was completed on the 15 August 2006 16:51:44 and PASSED the requirements for a valid MOT with 0 comments.

Recorded mileage: 10

Recorded mileage: 10