724 UYV


724UYV is registered to a Grey 1961, Morris Minor with a Petrol engine. It Passed its most recent MOT Test on the 20 November 2018

22 unique faults (26 Total) reported in its MOT History (16 Tests).

4 common/recurring faults, the most frequent (2 times) is: nearside front shock absorber has poor damping effect.

69% (11) MOT Pass Rate and a 31% (5) MOT Failure Rate.

67,351 recorded miles.

724 UYV


724UYV is registered to a Grey 1961, Morris Minor with a Petrol engine. It Passed its most recent MOT Test on the 20 November 2018

22 unique faults (26 Total) reported in its MOT History (16 Tests).

4 common/recurring faults, the most frequent (2 times) is: nearside front shock absorber has poor damping effect.

69% (11) MOT Pass Rate and a 31% (5) MOT Failure Rate.

67,351 recorded miles.

MOT PASS/Failure rate for 724 UYV

all MOT test results for 724 UYV represented as a percentage
MOT PASS/Failure rate for 724 UYV
all MOT test results for 724 UYV represented as a percentage

PERCENTAGE OF VEHICLE FAULTS WITH 724 UYV

ALL REPORTED FAULTS, DISPLAYED BY PERCENTAGE OF OCCURRENCE DURING ALL MOT TESTS
PERCENTAGE OF VEHICLE FAULTS WITH 724 UYV
ALL REPORTED FAULTS, DISPLAYED BY PERCENTAGE OF OCCURRENCE DURING ALL MOT TESTS
ADVISORY

FAIL

USER ENTERED

PASS WITH RECTIFICATION

724 UYV annual Faults by type

ALL REPORTED FAULTS, DISPLAYED over time and categorised by type
724 UYV annual Faults by type
ALL REPORTED FAULTS, DISPLAYED over time and categorised by type

RECURRING FAULTS WITH 724 UYV

FAULTS THAT HAVE OCCURED MORE THAN ONCE DURING 724 UYV's MOT HISTORY
RECURRING FAULTS WITH 724 UYV
FAULTS THAT HAVE OCCURED MORE THAN ONCE DURING 724 UYV's MOT HISTORY
Fault Fault Test Date Test Date/Time Reference MOT Test Reference
2 Nearside front shock absorber has poor damping effect Nearside front shock absorber has poor damping effect 14 July 2016 [11:33] 14/07/2016 08 July 2016 [11:29] 08/07/2016 907524656138 907524656138 369507290652 369507290652
2 Offside front floor corroded Offside front floor corroded 14 July 2016 [11:33] 14/07/2016 08 July 2016 [11:29] 08/07/2016 907524656138 907524656138 369507290652 369507290652
2 Parking brake: efficiency below requirements (3.7.b.7) Parking brake: efficiency below requirements (3.7.b.7) 07 August 2013 [12:39] 07/08/2013 23 July 2012 [09:35] 23/07/2012 317239913206 317239913206 349045902457 349045902457
2 Corrosion on under side and body Corrosion on under side and body 31 July 2012 [16:10] 31/07/2012 23 July 2012 [09:35] 23/07/2012 939713412290 939713412290 349045902457 349045902457

ALL 724 UYV ADVISORIES [9]

ALL ADVISORIES, ORDERED by OCCURRENCE DURING 724 UYV's MOT HISTORY
ALL 724 UYV ADVISORIES [9]
ALL ADVISORIES, ORDERED by OCCURRENCE DURING 724 UYV's MOT HISTORY
Advisory Faults | source www.vehiclestats.co.uk
Fault Fault Test Date Test Date/Time Reference MOT Test Reference
2 Nearside front shock absorber has poor damping effect Nearside front shock absorber has poor damping effect 14 July 2016 [11:33] 14/07/2016 08 July 2016 [11:29] 08/07/2016 907524656138 907524656138 369507290652 369507290652
2 Offside front floor corroded Offside front floor corroded 14 July 2016 [11:33] 14/07/2016 08 July 2016 [11:29] 08/07/2016 907524656138 907524656138 369507290652 369507290652
1 Oil leak Oil leak 20 November 2018 [08:33] 20/11/2018 548200753152 548200753152
1 Front wheel bearing has slight play (2.5.a.3c) Front wheel bearing has slight play (2.5.a.3c) 02 June 2017 [10:23] 02/06/2017 422040723149 422040723149
1 Parking brake: parking brake efficiency only just met. It would appear that the braking system requires adjustment or repair. (3.7.b.7) Parking brake: parking brake efficiency only just met. It would appear that the braking system requires adjustment or repair. (3.7.b.7) 31 July 2012 [16:10] 31/07/2012 939713412290 939713412290
1 Brakes imbalanced requirements only just met. It would appear that the braking system requires adjustment or repair. (3.7.b.5b) Brakes imbalanced requirements only just met. It would appear that the braking system requires adjustment or repair. (3.7.b.5b) 31 July 2012 [16:10] 31/07/2012 939713412290 939713412290
1 Offside front vehicle structure has slight corrosion (6.1.a.1) Offside front vehicle structure has slight corrosion (6.1.a.1) 01 August 2007 [08:34] 01/08/2007 840703817242 840703817242

ALL 724 UYV Failure Faults [13]

ALL Failure faults, ORDERED by OCCURRENCE DURING 724 UYV's MOT HISTORY
ALL 724 UYV Failure Faults [13]
ALL Failure faults, ORDERED by OCCURRENCE DURING 724 UYV's MOT HISTORY
Fail Faults | source www.vehiclestats.co.uk
Fault Fault Test Date Test Date/Time Reference MOT Test Reference
2 Parking brake: efficiency below requirements (3.7.b.7) Parking brake: efficiency below requirements (3.7.b.7) 07 August 2013 [12:39] 07/08/2013 23 July 2012 [09:35] 23/07/2012 317239913206 317239913206 349045902457 349045902457
1 Service brake is causing the vehicle to swerve to the offside (3.7.c.2) Service brake is causing the vehicle to swerve to the offside (3.7.c.2) 08 July 2016 [11:29] 08/07/2016 369507290652 369507290652
1 Nearside front brake binding (3.7.b.1) Nearside front brake binding (3.7.b.1) 08 July 2016 [11:29] 08/07/2016 369507290652 369507290652
1 Nearside front suspension has excessive play in a lower wishbone bearing (2.5.b.1a) Nearside front suspension has excessive play in a lower wishbone bearing (2.5.b.1a) 08 July 2016 [11:29] 08/07/2016 369507290652 369507290652
1 Nearside front suspension has excessive play in a upper wishbone bearing (2.5.b.1a) Nearside front suspension has excessive play in a upper wishbone bearing (2.5.b.1a) 08 July 2016 [11:29] 08/07/2016 369507290652 369507290652
1 Fuel cap/sealing device sealing washer missing (7.2.4c) Fuel cap/sealing device sealing washer missing (7.2.4c) 23 July 2012 [09:35] 23/07/2012 349045902457 349045902457
1 Offside front track rod end ball joint dust cover excessively damaged so that it no longer prevents the ingress of dirt (2.2.c.1c) Offside front track rod end ball joint dust cover excessively damaged so that it no longer prevents the ingress of dirt (2.2.c.1c) 23 July 2012 [09:35] 23/07/2012 349045902457 349045902457
1 Front exhaust has a major leak of exhaust gases (7.1.2) Front exhaust has a major leak of exhaust gases (7.1.2) 23 July 2012 [09:35] 23/07/2012 349045902457 349045902457
1 Nearside front suspension component mounting prescribed area is excessively corroded (2.4.a.3) Nearside front suspension component mounting prescribed area is excessively corroded (2.4.a.3) 23 July 2012 [09:35] 23/07/2012 349045902457 349045902457
1 Offside front suspension component mounting prescribed area is excessively corroded (2.4.a.3) Offside front suspension component mounting prescribed area is excessively corroded (2.4.a.3) 23 July 2012 [09:35] 23/07/2012 349045902457 349045902457
1 Nearside body or chassis has excessive corrosion, seriously affecting its strength within 30cm of the body mountings (6.1.b.2) Nearside body or chassis has excessive corrosion, seriously affecting its strength within 30cm of the body mountings (6.1.b.2) 10 February 2006 [14:19] 10/02/2006 590801246001 590801246001
1 Offside body or chassis has excessive corrosion, seriously affecting its strength within 30cm of the body mountings (6.1.b.2) Offside body or chassis has excessive corrosion, seriously affecting its strength within 30cm of the body mountings (6.1.b.2) 10 February 2006 [14:19] 10/02/2006 590801246001 590801246001

ALL 724 UYV User Entered Faults [3]

ALL User Entered faults, ORDERED by OCCURRENCE DURING 724 UYV's MOT HISTORY
ALL 724 UYV User Entered Faults [3]
ALL User Entered faults, ORDERED by OCCURRENCE DURING 724 UYV's MOT HISTORY
Advisory Faults | source www.vehiclestats.co.uk
Fault Fault Test Date Test Date/Time Reference MOT Test Reference
2 Corrosion on under side and body Corrosion on under side and body 31 July 2012 [16:10] 31/07/2012 23 July 2012 [09:35] 23/07/2012 939713412290 939713412290 349045902457 349045902457
1 Both rear tyres sidewalls in poor condition Both rear tyres sidewalls in poor condition 01 August 2007 [08:34] 01/08/2007 840703817242 840703817242

ALL 724 UYV Pass With Rectification Faults [1]

ALL Pass With Rectification faults, ORDERED by OCCURRENCE DURING 724 UYV's MOT HISTORY
ALL 724 UYV Pass With Rectification Faults [1]
ALL Pass With Rectification faults, ORDERED by OCCURRENCE DURING 724 UYV's MOT HISTORY
Pass With Rectification Faults | source www.vehiclestats.co.uk
Fault Fault Test Date Test Date/Time Reference MOT Test Reference
1 Registration plate lamp not working (1.1.5c) Registration plate lamp not working (1.1.5c) 30 July 2008 [08:05] 30/07/2008 222662118235 222662118235

MOT TEST: 20 November 2018 08:33:53 PASSED
MOT TEST: 20 November 2018 08:33:53 PASSED

This test (548200753152) was completed on the 20 November 2018 08:33:53 and PASSED the requirements for a valid MOT with 1 comments.

This test (548200753152) was completed on the 20 November 2018 08:33:53 and PASSED the requirements for a valid MOT with 1 comments.

Recorded mileage: 67,351

Recorded mileage: 67,351


ADVISORY


MOT TEST: 02 June 2017 10:23:51 PASSED
MOT TEST: 02 June 2017 10:23:51 PASSED

This test (422040723149) was completed on the 02 June 2017 10:23:51 and PASSED the requirements for a valid MOT with 1 comments.

This test (422040723149) was completed on the 02 June 2017 10:23:51 and PASSED the requirements for a valid MOT with 1 comments.

Recorded mileage: 66,137

Recorded mileage: 66,137


ADVISORY


MOT TEST: 14 July 2016 11:33:17 PASSED
MOT TEST: 14 July 2016 11:33:17 PASSED

This test (907524656138) was completed on the 14 July 2016 11:33:17 and PASSED the requirements for a valid MOT with 2 comments.

This test (907524656138) was completed on the 14 July 2016 11:33:17 and PASSED the requirements for a valid MOT with 2 comments.

Recorded mileage: 65,685

Recorded mileage: 65,685


ADVISORY


MOT TEST: 08 July 2016 11:29:21 FAILED
MOT TEST: 08 July 2016 11:29:21 FAILED

This test (369507290652) was completed on the 08 July 2016 11:29:21 and FAILED the requirements for a valid MOT with 6 comments.

This test (369507290652) was completed on the 08 July 2016 11:29:21 and FAILED the requirements for a valid MOT with 6 comments.

Recorded mileage: 65,683

Recorded mileage: 65,683


ADVISORY

FAIL


MOT TEST: 20 June 2014 16:17:25 PASSED
MOT TEST: 20 June 2014 16:17:25 PASSED

This test (168661874144) was completed on the 20 June 2014 16:17:25 and PASSED the requirements for a valid MOT with 0 comments.

This test (168661874144) was completed on the 20 June 2014 16:17:25 and PASSED the requirements for a valid MOT with 0 comments.

Recorded mileage: 65,638

Recorded mileage: 65,638


MOT TEST: 08 August 2013 11:59:34 PASSED
MOT TEST: 08 August 2013 11:59:34 PASSED

This test (996620523244) was completed on the 08 August 2013 11:59:34 and PASSED the requirements for a valid MOT with 0 comments.

This test (996620523244) was completed on the 08 August 2013 11:59:34 and PASSED the requirements for a valid MOT with 0 comments.

Recorded mileage: 65,553

Recorded mileage: 65,553


MOT TEST: 07 August 2013 12:39:10 FAILED
MOT TEST: 07 August 2013 12:39:10 FAILED

This test (317239913206) was completed on the 07 August 2013 12:39:10 and FAILED the requirements for a valid MOT with 1 comments.

This test (317239913206) was completed on the 07 August 2013 12:39:10 and FAILED the requirements for a valid MOT with 1 comments.

Recorded mileage: 65,547

Recorded mileage: 65,547


FAIL


MOT TEST: 31 July 2012 16:10:12 PASSED
MOT TEST: 31 July 2012 16:10:12 PASSED

This test (939713412290) was completed on the 31 July 2012 16:10:12 and PASSED the requirements for a valid MOT with 3 comments.

This test (939713412290) was completed on the 31 July 2012 16:10:12 and PASSED the requirements for a valid MOT with 3 comments.

Recorded mileage: 64,909

Recorded mileage: 64,909


ADVISORY

USER ENTERED


MOT TEST: 23 July 2012 09:35:27 FAILED
MOT TEST: 23 July 2012 09:35:27 FAILED

This test (349045902457) was completed on the 23 July 2012 09:35:27 and FAILED the requirements for a valid MOT with 7 comments.

This test (349045902457) was completed on the 23 July 2012 09:35:27 and FAILED the requirements for a valid MOT with 7 comments.

Recorded mileage: 64,909

Recorded mileage: 64,909


FAIL

USER ENTERED


MOT TEST: 13 July 2011 15:27:12 PASSED
MOT TEST: 13 July 2011 15:27:12 PASSED

This test (676704291127) was completed on the 13 July 2011 15:27:12 and PASSED the requirements for a valid MOT with 0 comments.

This test (676704291127) was completed on the 13 July 2011 15:27:12 and PASSED the requirements for a valid MOT with 0 comments.

Recorded mileage: 59,368

Recorded mileage: 59,368


MOT TEST: 05 August 2009 08:01:50 PASSED
MOT TEST: 05 August 2009 08:01:50 PASSED

This test (393617619272) was completed on the 05 August 2009 08:01:50 and PASSED the requirements for a valid MOT with 0 comments.

This test (393617619272) was completed on the 05 August 2009 08:01:50 and PASSED the requirements for a valid MOT with 0 comments.

Recorded mileage: 59,175

Recorded mileage: 59,175


MOT TEST: 30 July 2008 08:05:24 PASSED
MOT TEST: 30 July 2008 08:05:24 PASSED

This test (134642818278) was completed on the 30 July 2008 08:05:24 and PASSED the requirements for a valid MOT with 0 comments.

This test (134642818278) was completed on the 30 July 2008 08:05:24 and PASSED the requirements for a valid MOT with 0 comments.

Recorded mileage: 58,948

Recorded mileage: 58,948


MOT TEST: 30 July 2008 08:05:24 FAILED
MOT TEST: 30 July 2008 08:05:24 FAILED

This test (222662118235) was completed on the 30 July 2008 08:05:24 and FAILED the requirements for a valid MOT with 1 comments.

This test (222662118235) was completed on the 30 July 2008 08:05:24 and FAILED the requirements for a valid MOT with 1 comments.

Recorded mileage: 58,948

Recorded mileage: 58,948


PASS WITH RECTIFICATION


MOT TEST: 01 August 2007 08:34:57 PASSED
MOT TEST: 01 August 2007 08:34:57 PASSED

This test (840703817242) was completed on the 01 August 2007 08:34:57 and PASSED the requirements for a valid MOT with 2 comments.

This test (840703817242) was completed on the 01 August 2007 08:34:57 and PASSED the requirements for a valid MOT with 2 comments.

Recorded mileage: 58,555

Recorded mileage: 58,555


ADVISORY

USER ENTERED


MOT TEST: 11 February 2006 11:07:21 PASSED
MOT TEST: 11 February 2006 11:07:21 PASSED

This test (864462446044) was completed on the 11 February 2006 11:07:21 and PASSED the requirements for a valid MOT with 0 comments.

This test (864462446044) was completed on the 11 February 2006 11:07:21 and PASSED the requirements for a valid MOT with 0 comments.

Recorded mileage: 58,172

Recorded mileage: 58,172


MOT TEST: 10 February 2006 14:19:51 FAILED
MOT TEST: 10 February 2006 14:19:51 FAILED

This test (590801246001) was completed on the 10 February 2006 14:19:51 and FAILED the requirements for a valid MOT with 2 comments.

This test (590801246001) was completed on the 10 February 2006 14:19:51 and FAILED the requirements for a valid MOT with 2 comments.

Recorded mileage: 58,172

Recorded mileage: 58,172


FAIL