729 UXW


729UXW is registered to a Black 1959, Morris Minor 1000 with a Petrol engine. It Failed its most recent MOT Test on the 25 May 2012

27 unique faults (31 Total) reported in its MOT History (9 Tests).

3 common/recurring faults, the most frequent (3 times) is: Nearside Track rod end ball joint has slight play (2.2.B.1f).

78% (7) MOT Pass Rate and a 22% (2) MOT Failure Rate.

58,928 recorded miles.

729 UXW


729UXW is registered to a Black 1959, Morris Minor 1000 with a Petrol engine. It Failed its most recent MOT Test on the 25 May 2012

27 unique faults (31 Total) reported in its MOT History (9 Tests).

3 common/recurring faults, the most frequent (3 times) is: Nearside Track rod end ball joint has slight play (2.2.B.1f).

78% (7) MOT Pass Rate and a 22% (2) MOT Failure Rate.

58,928 recorded miles.

MOT PASS/Failure rate for 729 UXW

all MOT test results for 729 UXW represented as a percentage
MOT PASS/Failure rate for 729 UXW
all MOT test results for 729 UXW represented as a percentage

PERCENTAGE OF VEHICLE FAULTS WITH 729 UXW

ALL REPORTED FAULTS, DISPLAYED BY PERCENTAGE OF OCCURRENCE DURING ALL MOT TESTS
PERCENTAGE OF VEHICLE FAULTS WITH 729 UXW
ALL REPORTED FAULTS, DISPLAYED BY PERCENTAGE OF OCCURRENCE DURING ALL MOT TESTS
ADVISORY

FAIL

729 UXW annual Faults by type

ALL REPORTED FAULTS, DISPLAYED over time and categorised by type
729 UXW annual Faults by type
ALL REPORTED FAULTS, DISPLAYED over time and categorised by type

RECURRING FAULTS WITH 729 UXW

FAULTS THAT HAVE OCCURED MORE THAN ONCE DURING 729 UXW's MOT HISTORY
RECURRING FAULTS WITH 729 UXW
FAULTS THAT HAVE OCCURED MORE THAN ONCE DURING 729 UXW's MOT HISTORY
Fault Fault Test Date Test Date/Time Reference MOT Test Reference
3 Nearside track rod end ball joint has slight play (2.2.b.1f) Nearside track rod end ball joint has slight play (2.2.b.1f) 12 March 2010 [13:28] 12/03/2010 10 March 2010 [14:07] 10/03/2010 17 February 2009 [13:03] 17/02/2009 303641570005 303641570005 952349660044 952349660044 884718649078 884718649078
2 Nearside front wheel bearing has slight play (2.5.a.3c) Nearside front wheel bearing has slight play (2.5.a.3c) 10 March 2010 [14:07] 10/03/2010 17 February 2009 [13:03] 17/02/2009 952349660044 952349660044 884718649078 884718649078
2 Offside front wheel bearing has slight play (2.5.a.3c) Offside front wheel bearing has slight play (2.5.a.3c) 10 March 2010 [14:07] 10/03/2010 17 February 2009 [13:03] 17/02/2009 952349660044 952349660044 884718649078 884718649078

ALL 729 UXW ADVISORIES [21]

ALL ADVISORIES, ORDERED by OCCURRENCE DURING 729 UXW's MOT HISTORY
ALL 729 UXW ADVISORIES [21]
ALL ADVISORIES, ORDERED by OCCURRENCE DURING 729 UXW's MOT HISTORY
Advisory Faults | source www.vehiclestats.co.uk
Fault Fault Test Date Test Date/Time Reference MOT Test Reference
3 Nearside track rod end ball joint has slight play (2.2.b.1f) Nearside track rod end ball joint has slight play (2.2.b.1f) 12 March 2010 [13:28] 12/03/2010 10 March 2010 [14:07] 10/03/2010 17 February 2009 [13:03] 17/02/2009 303641570005 303641570005 952349660044 952349660044 884718649078 884718649078
2 Nearside front wheel bearing has slight play (2.5.a.3c) Nearside front wheel bearing has slight play (2.5.a.3c) 10 March 2010 [14:07] 10/03/2010 17 February 2009 [13:03] 17/02/2009 952349660044 952349660044 884718649078 884718649078
2 Offside front wheel bearing has slight play (2.5.a.3c) Offside front wheel bearing has slight play (2.5.a.3c) 10 March 2010 [14:07] 10/03/2010 17 February 2009 [13:03] 17/02/2009 952349660044 952349660044 884718649078 884718649078
1 Steering system has slight free play detected at steering wheel (2.2.a.1b) Steering system has slight free play detected at steering wheel (2.2.a.1b) 22 March 2011 [17:52] 22/03/2011 878191881027 878191881027
1 Offside front lower front suspension has slight play in a lower suspension ball joint (2.5.b.1a) Offside front lower front suspension has slight play in a lower suspension ball joint (2.5.b.1a) 22 March 2011 [17:52] 22/03/2011 878191881027 878191881027
1 Offside front upper front suspension has slight play in a upper suspension ball joint (2.5.b.1a) Offside front upper front suspension has slight play in a upper suspension ball joint (2.5.b.1a) 22 March 2011 [17:52] 22/03/2011 878191881027 878191881027
1 Front lower front suspension has slight play in a track control arm inner bush (2.5.b.2b) Front lower front suspension has slight play in a track control arm inner bush (2.5.b.2b) 22 March 2011 [17:52] 22/03/2011 878191881027 878191881027
1 Offside rear suspension spring mounting prescribed area is corroded but not considered excessive (2.4.a.3) Offside rear suspension spring mounting prescribed area is corroded but not considered excessive (2.4.a.3) 12 March 2010 [13:28] 12/03/2010 303641570005 303641570005
1 Nearside rear suspension spring mounting prescribed area is corroded but not considered excessive (2.4.a.3) Nearside rear suspension spring mounting prescribed area is corroded but not considered excessive (2.4.a.3) 10 March 2010 [14:07] 10/03/2010 952349660044 952349660044
1 Offside outer front lower suspension arm has slight play in a pin/bush (2.4.g.2) Offside outer front lower suspension arm has slight play in a pin/bush (2.4.g.2) 17 February 2009 [13:03] 17/02/2009 884718649078 884718649078
1 Nearside outer front upper front suspension has slight movement at a wishbone pin or bush (2.5.a.1c) Nearside outer front upper front suspension has slight movement at a wishbone pin or bush (2.5.a.1c) 08 February 2008 [14:08] 08/02/2008 273579438040 273579438040
1 Nearside outer front lower front suspension has slight movement at a wishbone pin or bush (2.5.a.1c) Nearside outer front lower front suspension has slight movement at a wishbone pin or bush (2.5.a.1c) 08 February 2008 [14:08] 08/02/2008 273579438040 273579438040
1 Offside outer front upper front suspension has slight movement at a wishbone pin or bush (2.5.a.1c) Offside outer front upper front suspension has slight movement at a wishbone pin or bush (2.5.a.1c) 08 February 2008 [14:08] 08/02/2008 273579438040 273579438040
1 Offside outer front lower front suspension has slight movement at a wishbone pin or bush (2.5.a.1c) Offside outer front lower front suspension has slight movement at a wishbone pin or bush (2.5.a.1c) 08 February 2008 [14:08] 08/02/2008 273579438040 273579438040
1 Nearside front upper suspension arm has slight play in a pin/bush (2.4.g.2) Nearside front upper suspension arm has slight play in a pin/bush (2.4.g.2) 22 January 2007 [14:04] 22/01/2007 410452127022 410452127022
1 Offside front suspension arm has slight play in a pin/bush (2.4.g.2) Offside front suspension arm has slight play in a pin/bush (2.4.g.2) 22 January 2007 [14:04] 22/01/2007 410452127022 410452127022
1 Rear parking brake: parking brake efficiency only just met. It would appear that the braking system requires adjustment or repair. (3.7.b.7) Rear parking brake: parking brake efficiency only just met. It would appear that the braking system requires adjustment or repair. (3.7.b.7) 22 January 2007 [14:04] 22/01/2007 410452127022 410452127022

ALL 729 UXW Failure Faults [10]

ALL Failure faults, ORDERED by OCCURRENCE DURING 729 UXW's MOT HISTORY
ALL 729 UXW Failure Faults [10]
ALL Failure faults, ORDERED by OCCURRENCE DURING 729 UXW's MOT HISTORY
Fail Faults | source www.vehiclestats.co.uk
Fault Fault Test Date Test Date/Time Reference MOT Test Reference
1 Nearside front brake hose excessively damaged (3.6.b.4d) Nearside front brake hose excessively damaged (3.6.b.4d) 10 March 2010 [14:07] 10/03/2010 952349660044 952349660044
1 Offside front tyre has a bulge, caused by separation or partial failure of its structure (4.1.d.1b) Offside front tyre has a bulge, caused by separation or partial failure of its structure (4.1.d.1b) 16 December 2005 [12:22] 16/12/2005 554540955318 554540955318
1 Windscreen washer provides insufficient washer liquid (8.2.3) Windscreen washer provides insufficient washer liquid (8.2.3) 16 December 2005 [12:22] 16/12/2005 554540955318 554540955318
1 Offside front position lamp(s) not working (1.1.a.3b) Offside front position lamp(s) not working (1.1.a.3b) 16 December 2005 [12:22] 16/12/2005 554540955318 554540955318
1 Nearside front position lamp(s) not working (1.1.a.3b) Nearside front position lamp(s) not working (1.1.a.3b) 16 December 2005 [12:22] 16/12/2005 554540955318 554540955318
1 Offside rear suspension spring mounting prescribed area is excessively corroded (2.4.a.3) Offside rear suspension spring mounting prescribed area is excessively corroded (2.4.a.3) 16 December 2005 [12:22] 16/12/2005 554540955318 554540955318
1 Nearside outer rear suspension spring mounting prescribed area is excessively corroded (2.4.a.3) Nearside outer rear suspension spring mounting prescribed area is excessively corroded (2.4.a.3) 16 December 2005 [12:22] 16/12/2005 554540955318 554540955318
1 Horn control missing (1.6.1) Horn control missing (1.6.1) 16 December 2005 [12:22] 16/12/2005 554540955318 554540955318
1 Nearside rear rear brake binding (3.7.b.1) Nearside rear rear brake binding (3.7.b.1) 16 December 2005 [12:22] 16/12/2005 554540955318 554540955318
1 Brakes imbalanced across an axle (3.7.b.5b) Brakes imbalanced across an axle (3.7.b.5b) 16 December 2005 [12:22] 16/12/2005 554540955318 554540955318

MOT TEST: 25 May 2012 17:22:28 PASSED
MOT TEST: 25 May 2012 17:22:28 PASSED

This test (187646542175) was completed on the 25 May 2012 17:22:28 and PASSED the requirements for a valid MOT with 0 comments.

This test (187646542175) was completed on the 25 May 2012 17:22:28 and PASSED the requirements for a valid MOT with 0 comments.

Recorded mileage: 58,928

Recorded mileage: 58,928


MOT TEST: 22 March 2011 17:52:33 PASSED
MOT TEST: 22 March 2011 17:52:33 PASSED

This test (878191881027) was completed on the 22 March 2011 17:52:33 and PASSED the requirements for a valid MOT with 4 comments.

This test (878191881027) was completed on the 22 March 2011 17:52:33 and PASSED the requirements for a valid MOT with 4 comments.

Recorded mileage: 58,635

Recorded mileage: 58,635


ADVISORY


MOT TEST: 12 March 2010 13:28:04 PASSED
MOT TEST: 12 March 2010 13:28:04 PASSED

This test (303641570005) was completed on the 12 March 2010 13:28:04 and PASSED the requirements for a valid MOT with 2 comments.

This test (303641570005) was completed on the 12 March 2010 13:28:04 and PASSED the requirements for a valid MOT with 2 comments.

Recorded mileage: 58,310

Recorded mileage: 58,310


ADVISORY


MOT TEST: 10 March 2010 14:07:43 FAILED
MOT TEST: 10 March 2010 14:07:43 FAILED

This test (952349660044) was completed on the 10 March 2010 14:07:43 and FAILED the requirements for a valid MOT with 5 comments.

This test (952349660044) was completed on the 10 March 2010 14:07:43 and FAILED the requirements for a valid MOT with 5 comments.

Recorded mileage: 58,309

Recorded mileage: 58,309


ADVISORY

FAIL


MOT TEST: 17 February 2009 13:03:28 PASSED
MOT TEST: 17 February 2009 13:03:28 PASSED

This test (884718649078) was completed on the 17 February 2009 13:03:28 and PASSED the requirements for a valid MOT with 4 comments.

This test (884718649078) was completed on the 17 February 2009 13:03:28 and PASSED the requirements for a valid MOT with 4 comments.

Recorded mileage: 58,041

Recorded mileage: 58,041


ADVISORY


MOT TEST: 08 February 2008 14:08:14 PASSED
MOT TEST: 08 February 2008 14:08:14 PASSED

This test (273579438040) was completed on the 08 February 2008 14:08:14 and PASSED the requirements for a valid MOT with 4 comments.

This test (273579438040) was completed on the 08 February 2008 14:08:14 and PASSED the requirements for a valid MOT with 4 comments.

Recorded mileage: 57,541

Recorded mileage: 57,541


ADVISORY


MOT TEST: 22 January 2007 14:04:10 PASSED
MOT TEST: 22 January 2007 14:04:10 PASSED

This test (410452127022) was completed on the 22 January 2007 14:04:10 and PASSED the requirements for a valid MOT with 3 comments.

This test (410452127022) was completed on the 22 January 2007 14:04:10 and PASSED the requirements for a valid MOT with 3 comments.

Recorded mileage: 57,311

Recorded mileage: 57,311


ADVISORY


MOT TEST: 16 February 2006 09:42:04 PASSED
MOT TEST: 16 February 2006 09:42:04 PASSED

This test (523747046071) was completed on the 16 February 2006 09:42:04 and PASSED the requirements for a valid MOT with 0 comments.

This test (523747046071) was completed on the 16 February 2006 09:42:04 and PASSED the requirements for a valid MOT with 0 comments.

Recorded mileage: 56,789

Recorded mileage: 56,789


MOT TEST: 16 December 2005 12:22:03 FAILED
MOT TEST: 16 December 2005 12:22:03 FAILED

This test (554540955318) was completed on the 16 December 2005 12:22:03 and FAILED the requirements for a valid MOT with 9 comments.

This test (554540955318) was completed on the 16 December 2005 12:22:03 and FAILED the requirements for a valid MOT with 9 comments.

Recorded mileage: 56,789

Recorded mileage: 56,789


FAIL