736 5RU


7365RU is registered to a Cream 1963, Morris Mini moke with a Petrol engine. It Failed its most recent MOT Test on the 26 July 2017

45 unique faults (56 Total) reported in its MOT History (15 Tests).

9 common/recurring faults, the most frequent (3 times) is: Parking brake: parking brake efficiency only just met. It would appear that the braking system requires adjustment or repair. (3.7.B.7).

60% (9) MOT Pass Rate and a 40% (6) MOT Failure Rate.

331,493 recorded miles.

736 5RU


7365RU is registered to a Cream 1963, Morris Mini moke with a Petrol engine. It Failed its most recent MOT Test on the 26 July 2017

45 unique faults (56 Total) reported in its MOT History (15 Tests).

9 common/recurring faults, the most frequent (3 times) is: Parking brake: parking brake efficiency only just met. It would appear that the braking system requires adjustment or repair. (3.7.B.7).

60% (9) MOT Pass Rate and a 40% (6) MOT Failure Rate.

331,493 recorded miles.

MOT PASS/Failure rate for 736 5RU

all MOT test results for 736 5RU represented as a percentage
MOT PASS/Failure rate for 736 5RU
all MOT test results for 736 5RU represented as a percentage

PERCENTAGE OF VEHICLE FAULTS WITH 736 5RU

ALL REPORTED FAULTS, DISPLAYED BY PERCENTAGE OF OCCURRENCE DURING ALL MOT TESTS
PERCENTAGE OF VEHICLE FAULTS WITH 736 5RU
ALL REPORTED FAULTS, DISPLAYED BY PERCENTAGE OF OCCURRENCE DURING ALL MOT TESTS
ADVISORY

FAIL

USER ENTERED

PASS WITH RECTIFICATION

736 5RU annual Faults by type

ALL REPORTED FAULTS, DISPLAYED over time and categorised by type
736 5RU annual Faults by type
ALL REPORTED FAULTS, DISPLAYED over time and categorised by type

RECURRING FAULTS WITH 736 5RU

FAULTS THAT HAVE OCCURED MORE THAN ONCE DURING 736 5RU's MOT HISTORY
RECURRING FAULTS WITH 736 5RU
FAULTS THAT HAVE OCCURED MORE THAN ONCE DURING 736 5RU's MOT HISTORY
Fault Fault Test Date Test Date/Time Reference MOT Test Reference
3 Parking brake: parking brake efficiency only just met. It would appear that the braking system requires adjustment or repair. (3.7.b.7) Parking brake: parking brake efficiency only just met. It would appear that the braking system requires adjustment or repair. (3.7.b.7) 20 August 2013 [13:34] 20/08/2013 20 May 2011 [10:33] 20/05/2011 20 May 2011 [10:33] 20/05/2011 995152833201 995152833201 805060441149 805060441149 639190941181 639190941181
3 Rear service brake: service brake efficiency only just met. It would appear that the braking system requires adjustment or repair. (3.7.b.7) Rear service brake: service brake efficiency only just met. It would appear that the braking system requires adjustment or repair. (3.7.b.7) 20 August 2013 [13:34] 20/08/2013 20 May 2011 [10:33] 20/05/2011 20 May 2011 [10:33] 20/05/2011 995152833201 995152833201 805060441149 805060441149 639190941181 639190941181
2 Vehicle structure has slight corrosion (6.1.b.2) Vehicle structure has slight corrosion (6.1.b.2) 26 July 2017 [08:03] 26/07/2017 26 July 2017 [08:03] 26/07/2017 581434102004 581434102004 645598549944 645598549944
2 Brakes imbalanced across an axle (3.7.b.5b) Brakes imbalanced across an axle (3.7.b.5b) 11 July 2016 [15:32] 11/07/2016 22 July 2014 [16:50] 22/07/2014 949189777225 949189777225 338583904450 338583904450
2 Offside rear brake recording little or no effort (3.7.b.5a) Offside rear brake recording little or no effort (3.7.b.5a) 11 July 2016 [15:32] 11/07/2016 20 May 2011 [10:33] 20/05/2011 949189777225 949189777225 639190941181 639190941181
2 Nearside stop lamp not working (1.2.1b) Nearside stop lamp not working (1.2.1b) 11 July 2016 [15:32] 11/07/2016 22 July 2014 [16:50] 22/07/2014 949189777225 949189777225 338583904450 338583904450
2 Nearside front constant velocity joint gaiter deteriorated (2.5.c.1a) Nearside front constant velocity joint gaiter deteriorated (2.5.c.1a) 20 May 2011 [10:33] 20/05/2011 20 May 2011 [10:33] 20/05/2011 805060441149 805060441149 639190941181 639190941181
2 Offside front constant velocity joint gaiter deteriorated (2.5.c.1a) Offside front constant velocity joint gaiter deteriorated (2.5.c.1a) 20 May 2011 [10:33] 20/05/2011 20 May 2011 [10:33] 20/05/2011 805060441149 805060441149 639190941181 639190941181
2 Front headlamp not in good working order but not adversely affecting beam image (1.2.4a) Front headlamp not in good working order but not adversely affecting beam image (1.2.4a) 23 August 2007 [13:57] 23/08/2007 23 August 2007 [13:57] 23/08/2007 341725737258 341725737258 120895437296 120895437296

ALL 736 5RU ADVISORIES [16]

ALL ADVISORIES, ORDERED by OCCURRENCE DURING 736 5RU's MOT HISTORY
ALL 736 5RU ADVISORIES [16]
ALL ADVISORIES, ORDERED by OCCURRENCE DURING 736 5RU's MOT HISTORY
Advisory Faults | source www.vehiclestats.co.uk
Fault Fault Test Date Test Date/Time Reference MOT Test Reference
3 Parking brake: parking brake efficiency only just met. It would appear that the braking system requires adjustment or repair. (3.7.b.7) Parking brake: parking brake efficiency only just met. It would appear that the braking system requires adjustment or repair. (3.7.b.7) 20 August 2013 [13:34] 20/08/2013 20 May 2011 [10:33] 20/05/2011 20 May 2011 [10:33] 20/05/2011 995152833201 995152833201 805060441149 805060441149 639190941181 639190941181
3 Rear service brake: service brake efficiency only just met. It would appear that the braking system requires adjustment or repair. (3.7.b.7) Rear service brake: service brake efficiency only just met. It would appear that the braking system requires adjustment or repair. (3.7.b.7) 20 August 2013 [13:34] 20/08/2013 20 May 2011 [10:33] 20/05/2011 20 May 2011 [10:33] 20/05/2011 995152833201 995152833201 805060441149 805060441149 639190941181 639190941181
2 Vehicle structure has slight corrosion (6.1.b.2) Vehicle structure has slight corrosion (6.1.b.2) 26 July 2017 [08:03] 26/07/2017 26 July 2017 [08:03] 26/07/2017 581434102004 581434102004 645598549944 645598549944
2 Nearside front constant velocity joint gaiter deteriorated (2.5.c.1a) Nearside front constant velocity joint gaiter deteriorated (2.5.c.1a) 20 May 2011 [10:33] 20/05/2011 20 May 2011 [10:33] 20/05/2011 805060441149 805060441149 639190941181 639190941181
2 Offside front constant velocity joint gaiter deteriorated (2.5.c.1a) Offside front constant velocity joint gaiter deteriorated (2.5.c.1a) 20 May 2011 [10:33] 20/05/2011 20 May 2011 [10:33] 20/05/2011 805060441149 805060441149 639190941181 639190941181
2 Front headlamp not in good working order but not adversely affecting beam image (1.2.4a) Front headlamp not in good working order but not adversely affecting beam image (1.2.4a) 23 August 2007 [13:57] 23/08/2007 23 August 2007 [13:57] 23/08/2007 341725737258 341725737258 120895437296 120895437296
1 Nearside rear anti-roll bar linkage has slight play in a pin/bush (2.4.g.2) Nearside rear anti-roll bar linkage has slight play in a pin/bush (2.4.g.2) 27 January 2009 [15:28] 27/01/2009 352377229048 352377229048
1 Offside rear anti-roll bar linkage has slight play in a pin/bush (2.4.g.2) Offside rear anti-roll bar linkage has slight play in a pin/bush (2.4.g.2) 27 January 2009 [15:28] 27/01/2009 352377229048 352377229048

ALL 736 5RU Failure Faults [31]

ALL Failure faults, ORDERED by OCCURRENCE DURING 736 5RU's MOT HISTORY
ALL 736 5RU Failure Faults [31]
ALL Failure faults, ORDERED by OCCURRENCE DURING 736 5RU's MOT HISTORY
Fail Faults | source www.vehiclestats.co.uk
Fault Fault Test Date Test Date/Time Reference MOT Test Reference
2 Brakes imbalanced across an axle (3.7.b.5b) Brakes imbalanced across an axle (3.7.b.5b) 11 July 2016 [15:32] 11/07/2016 22 July 2014 [16:50] 22/07/2014 949189777225 949189777225 338583904450 338583904450
2 Nearside stop lamp not working (1.2.1b) Nearside stop lamp not working (1.2.1b) 11 July 2016 [15:32] 11/07/2016 22 July 2014 [16:50] 22/07/2014 949189777225 949189777225 338583904450 338583904450
1 Parking brake: efficiency below requirements (3.7.b.7) Parking brake: efficiency below requirements (3.7.b.7) 11 July 2016 [15:32] 11/07/2016 949189777225 949189777225
1 Rear brakes imbalanced across an axle axle 2 (3.7.b.5b) Rear brakes imbalanced across an axle axle 2 (3.7.b.5b) 11 July 2016 [15:32] 11/07/2016 949189777225 949189777225
1 Nearside front brake binding (3.7.b.1) Nearside front brake binding (3.7.b.1) 11 July 2016 [15:32] 11/07/2016 949189777225 949189777225
1 Offside rear brake recording little or no effort (3.7.b.5a) Offside rear brake recording little or no effort (3.7.b.5a) 11 July 2016 [15:32] 11/07/2016 949189777225 949189777225
1 Nearside windscreen wiper blade insecure (8.2.2) Nearside windscreen wiper blade insecure (8.2.2) 11 July 2016 [15:32] 11/07/2016 949189777225 949189777225
1 Windscreen washer provides insufficient washer liquid not working (8.2.3) Windscreen washer provides insufficient washer liquid not working (8.2.3) 11 July 2016 [15:32] 11/07/2016 949189777225 949189777225
1 Windscreen has a sticker or other obstruction encroaching by more than 10mm within zone 'a' wipers park in drivers view (8.3.1b) Windscreen has a sticker or other obstruction encroaching by more than 10mm within zone 'a' wipers park in drivers view (8.3.1b) 11 July 2016 [15:32] 11/07/2016 949189777225 949189777225
1 Horn not working (1.6.2a) Horn not working (1.6.2a) 11 July 2016 [15:32] 11/07/2016 949189777225 949189777225
1 Battery insecure (1.9.1) Battery insecure (1.9.1) 11 July 2016 [15:32] 11/07/2016 949189777225 949189777225
1 Nearside rear position lamp(s) not working (1.1.a.3b) Nearside rear position lamp(s) not working (1.1.a.3b) 11 July 2016 [15:32] 11/07/2016 949189777225 949189777225
1 Nearside registration plate lamp not working (1.1.c.1d) Nearside registration plate lamp not working (1.1.c.1d) 11 July 2016 [15:32] 11/07/2016 949189777225 949189777225
1 Nearside headlamp aim too low (1.8) Nearside headlamp aim too low (1.8) 11 July 2016 [15:32] 11/07/2016 949189777225 949189777225
1 Offside headlamp aim too low (1.8) Offside headlamp aim too low (1.8) 11 July 2016 [15:32] 11/07/2016 949189777225 949189777225
1 Main beam 'tell-tale' not working on when lights are dipped (1.7.4c) Main beam 'tell-tale' not working on when lights are dipped (1.7.4c) 11 July 2016 [15:32] 11/07/2016 949189777225 949189777225
1 Nearside rear reflector missing (1.5.1a) Nearside rear reflector missing (1.5.1a) 11 July 2016 [15:32] 11/07/2016 949189777225 949189777225
1 Offside rear reflector missing (1.5.1a) Offside rear reflector missing (1.5.1a) 11 July 2016 [15:32] 11/07/2016 949189777225 949189777225
1 Offside stop lamp not working (1.2.1b) Offside stop lamp not working (1.2.1b) 11 July 2016 [15:32] 11/07/2016 949189777225 949189777225
1 Nearside windscreen wiper not operating over a large enough area to give an adequate view (8.2.1c) Nearside windscreen wiper not operating over a large enough area to give an adequate view (8.2.1c) 22 July 2014 [16:50] 22/07/2014 338583904450 338583904450
1 Offside windscreen wiper not operating over a large enough area to give an adequate view (8.2.1c) Offside windscreen wiper not operating over a large enough area to give an adequate view (8.2.1c) 22 July 2014 [16:50] 22/07/2014 338583904450 338583904450
1 All position lamps not working (1.1.a.3b) All position lamps not working (1.1.a.3b) 22 July 2014 [16:50] 22/07/2014 338583904450 338583904450
1 Headlamp not working on dipped beam (1.7.5a) Headlamp not working on dipped beam (1.7.5a) 22 July 2014 [16:50] 22/07/2014 338583904450 338583904450
1 Headlamp not working on main beam (1.7.5a) Headlamp not working on main beam (1.7.5a) 22 July 2014 [16:50] 22/07/2014 338583904450 338583904450
1 Front exhaust has a major leak of exhaust gases (7.1.2) Front exhaust has a major leak of exhaust gases (7.1.2) 22 July 2014 [16:50] 22/07/2014 338583904450 338583904450
1 Nearside steering rack gaiter split (2.2.d.2d) Nearside steering rack gaiter split (2.2.d.2d) 22 July 2014 [16:50] 22/07/2014 338583904450 338583904450
1 Offside steering rack gaiter split (2.2.d.2d) Offside steering rack gaiter split (2.2.d.2d) 22 July 2014 [16:50] 22/07/2014 338583904450 338583904450
1 Nearside front constant velocity joint gaiter insecure to the extent that it no longer prevents the ingress of dirt etc (2.5.c.1a) Nearside front constant velocity joint gaiter insecure to the extent that it no longer prevents the ingress of dirt etc (2.5.c.1a) 22 July 2014 [16:50] 22/07/2014 338583904450 338583904450
1 Fuel pipe insecure (7.2.1) Fuel pipe insecure (7.2.1) 22 July 2014 [16:50] 22/07/2014 338583904450 338583904450

ALL 736 5RU User Entered Faults [1]

ALL User Entered faults, ORDERED by OCCURRENCE DURING 736 5RU's MOT HISTORY
ALL 736 5RU User Entered Faults [1]
ALL User Entered faults, ORDERED by OCCURRENCE DURING 736 5RU's MOT HISTORY
Advisory Faults | source www.vehiclestats.co.uk
Fault Fault Test Date Test Date/Time Reference MOT Test Reference
1 Oil leak Oil leak 27 January 2009 [15:28] 27/01/2009 352377229048 352377229048

ALL 736 5RU Pass With Rectification Faults [8]

ALL Pass With Rectification faults, ORDERED by OCCURRENCE DURING 736 5RU's MOT HISTORY
ALL 736 5RU Pass With Rectification Faults [8]
ALL Pass With Rectification faults, ORDERED by OCCURRENCE DURING 736 5RU's MOT HISTORY
Pass With Rectification Faults | source www.vehiclestats.co.uk
Fault Fault Test Date Test Date/Time Reference MOT Test Reference
1 Nearside headlamp insecure (1.7.3) Nearside headlamp insecure (1.7.3) 26 July 2017 [08:03] 26/07/2017 645598549944 645598549944
1 Battery insecure also battery cover loose. (1.9.1) Battery insecure also battery cover loose. (1.9.1) 26 July 2017 [08:03] 26/07/2017 645598549944 645598549944
1 Nearside rear brake recording little or no effort (3.7.b.5a) Nearside rear brake recording little or no effort (3.7.b.5a) 20 May 2011 [10:33] 20/05/2011 639190941181 639190941181
1 Offside rear brake recording little or no effort (3.7.b.5a) Offside rear brake recording little or no effort (3.7.b.5a) 20 May 2011 [10:33] 20/05/2011 639190941181 639190941181
1 Nearside headlamp aim too high (1.8) Nearside headlamp aim too high (1.8) 19 May 2010 [11:05] 19/05/2010 454749230110 454749230110
1 Offside headlamp aim too high (1.8) Offside headlamp aim too high (1.8) 19 May 2010 [11:05] 19/05/2010 454749230110 454749230110
1 Centre obligatory mirror missing (8.1.1) Centre obligatory mirror missing (8.1.1) 19 May 2010 [11:05] 19/05/2010 454749230110 454749230110
1 Brake pedal anti-slip provision loose (3.3.a.1b) Brake pedal anti-slip provision loose (3.3.a.1b) 23 August 2007 [13:57] 23/08/2007 120895437296 120895437296

MOT TEST: 26 July 2017 08:03:05 PASSED
MOT TEST: 26 July 2017 08:03:05 PASSED

This test (581434102004) was completed on the 26 July 2017 08:03:05 and PASSED the requirements for a valid MOT with 1 comments.

This test (581434102004) was completed on the 26 July 2017 08:03:05 and PASSED the requirements for a valid MOT with 1 comments.

Recorded mileage: 33,522

Recorded mileage: 33,522


ADVISORY


MOT TEST: 26 July 2017 08:03:04 FAILED
MOT TEST: 26 July 2017 08:03:04 FAILED

This test (645598549944) was completed on the 26 July 2017 08:03:04 and FAILED the requirements for a valid MOT with 3 comments.

This test (645598549944) was completed on the 26 July 2017 08:03:04 and FAILED the requirements for a valid MOT with 3 comments.

Recorded mileage: 33,522

Recorded mileage: 33,522


ADVISORY

PASS WITH RECTIFICATION


MOT TEST: 29 July 2016 11:15:50 PASSED
MOT TEST: 29 July 2016 11:15:50 PASSED

This test (805120042578) was completed on the 29 July 2016 11:15:50 and PASSED the requirements for a valid MOT with 0 comments.

This test (805120042578) was completed on the 29 July 2016 11:15:50 and PASSED the requirements for a valid MOT with 0 comments.

Recorded mileage: 33,522

Recorded mileage: 33,522


MOT TEST: 11 July 2016 15:32:59 FAILED
MOT TEST: 11 July 2016 15:32:59 FAILED

This test (949189777225) was completed on the 11 July 2016 15:32:59 and FAILED the requirements for a valid MOT with 19 comments.

This test (949189777225) was completed on the 11 July 2016 15:32:59 and FAILED the requirements for a valid MOT with 19 comments.

Recorded mileage: 33,522

Recorded mileage: 33,522


FAIL


MOT TEST: 31 July 2014 16:31:42 PASSED
MOT TEST: 31 July 2014 16:31:42 PASSED

This test (576852914241) was completed on the 31 July 2014 16:31:42 and PASSED the requirements for a valid MOT with 0 comments.

This test (576852914241) was completed on the 31 July 2014 16:31:42 and PASSED the requirements for a valid MOT with 0 comments.

Recorded mileage: 33,522

Recorded mileage: 33,522


MOT TEST: 22 July 2014 16:50:13 FAILED
MOT TEST: 22 July 2014 16:50:13 FAILED

This test (338583904450) was completed on the 22 July 2014 16:50:13 and FAILED the requirements for a valid MOT with 12 comments.

This test (338583904450) was completed on the 22 July 2014 16:50:13 and FAILED the requirements for a valid MOT with 12 comments.

Recorded mileage: 33,522

Recorded mileage: 33,522


FAIL


MOT TEST: 20 August 2013 13:34:32 PASSED
MOT TEST: 20 August 2013 13:34:32 PASSED

This test (995152833201) was completed on the 20 August 2013 13:34:32 and PASSED the requirements for a valid MOT with 2 comments.

This test (995152833201) was completed on the 20 August 2013 13:34:32 and PASSED the requirements for a valid MOT with 2 comments.

Recorded mileage: 33,498

Recorded mileage: 33,498


ADVISORY


MOT TEST: 30 April 2012 15:09:33 PASSED
MOT TEST: 30 April 2012 15:09:33 PASSED

This test (278181422140) was completed on the 30 April 2012 15:09:33 and PASSED the requirements for a valid MOT with 0 comments.

This test (278181422140) was completed on the 30 April 2012 15:09:33 and PASSED the requirements for a valid MOT with 0 comments.

Recorded mileage: 33,500

Recorded mileage: 33,500


MOT TEST: 20 May 2011 10:33:08 PASSED
MOT TEST: 20 May 2011 10:33:08 PASSED

This test (805060441149) was completed on the 20 May 2011 10:33:08 and PASSED the requirements for a valid MOT with 4 comments.

This test (805060441149) was completed on the 20 May 2011 10:33:08 and PASSED the requirements for a valid MOT with 4 comments.

Recorded mileage: 33,356

Recorded mileage: 33,356


ADVISORY


MOT TEST: 20 May 2011 10:33:08 FAILED
MOT TEST: 20 May 2011 10:33:08 FAILED

This test (639190941181) was completed on the 20 May 2011 10:33:08 and FAILED the requirements for a valid MOT with 6 comments.

This test (639190941181) was completed on the 20 May 2011 10:33:08 and FAILED the requirements for a valid MOT with 6 comments.

Recorded mileage: 33,356

Recorded mileage: 33,356


ADVISORY

PASS WITH RECTIFICATION


MOT TEST: 19 May 2010 11:05:09 PASSED
MOT TEST: 19 May 2010 11:05:09 PASSED

This test (112819230171) was completed on the 19 May 2010 11:05:09 and PASSED the requirements for a valid MOT with 0 comments.

This test (112819230171) was completed on the 19 May 2010 11:05:09 and PASSED the requirements for a valid MOT with 0 comments.

Recorded mileage: 331,493

Recorded mileage: 331,493


MOT TEST: 19 May 2010 11:05:09 FAILED
MOT TEST: 19 May 2010 11:05:09 FAILED

This test (454749230110) was completed on the 19 May 2010 11:05:09 and FAILED the requirements for a valid MOT with 3 comments.

This test (454749230110) was completed on the 19 May 2010 11:05:09 and FAILED the requirements for a valid MOT with 3 comments.

Recorded mileage: 331,493

Recorded mileage: 331,493


PASS WITH RECTIFICATION


MOT TEST: 27 January 2009 15:28:40 PASSED
MOT TEST: 27 January 2009 15:28:40 PASSED

This test (352377229048) was completed on the 27 January 2009 15:28:40 and PASSED the requirements for a valid MOT with 3 comments.

This test (352377229048) was completed on the 27 January 2009 15:28:40 and PASSED the requirements for a valid MOT with 3 comments.

Recorded mileage: 331,285

Recorded mileage: 331,285


ADVISORY

USER ENTERED


MOT TEST: 23 August 2007 13:57:00 PASSED
MOT TEST: 23 August 2007 13:57:00 PASSED

This test (341725737258) was completed on the 23 August 2007 13:57:00 and PASSED the requirements for a valid MOT with 1 comments.

This test (341725737258) was completed on the 23 August 2007 13:57:00 and PASSED the requirements for a valid MOT with 1 comments.

Recorded mileage: 33,093

Recorded mileage: 33,093


ADVISORY


MOT TEST: 23 August 2007 13:57:00 FAILED
MOT TEST: 23 August 2007 13:57:00 FAILED

This test (120895437296) was completed on the 23 August 2007 13:57:00 and FAILED the requirements for a valid MOT with 2 comments.

This test (120895437296) was completed on the 23 August 2007 13:57:00 and FAILED the requirements for a valid MOT with 2 comments.

Recorded mileage: 33,093

Recorded mileage: 33,093


ADVISORY

PASS WITH RECTIFICATION