736 DKP


736DKP is registered to a Grey 1958, Morris Minor with a Petrol engine. It Failed its most recent MOT Test on the 04 September 2010

10 unique faults (10 Total) reported in its MOT History (3 Tests).

0 common/recurring faults.

67% (2) MOT Pass Rate and a 33% (1) MOT Failure Rate.

65,969 recorded miles.

736 DKP


736DKP is registered to a Grey 1958, Morris Minor with a Petrol engine. It Failed its most recent MOT Test on the 04 September 2010

10 unique faults (10 Total) reported in its MOT History (3 Tests).

0 common/recurring faults.

67% (2) MOT Pass Rate and a 33% (1) MOT Failure Rate.

65,969 recorded miles.

MOT PASS/Failure rate for 736 DKP

all MOT test results for 736 DKP represented as a percentage
MOT PASS/Failure rate for 736 DKP
all MOT test results for 736 DKP represented as a percentage

PERCENTAGE OF VEHICLE FAULTS WITH 736 DKP

ALL REPORTED FAULTS, DISPLAYED BY PERCENTAGE OF OCCURRENCE DURING ALL MOT TESTS
PERCENTAGE OF VEHICLE FAULTS WITH 736 DKP
ALL REPORTED FAULTS, DISPLAYED BY PERCENTAGE OF OCCURRENCE DURING ALL MOT TESTS
FAIL

736 DKP annual Faults by type

ALL REPORTED FAULTS, DISPLAYED over time and categorised by type
736 DKP annual Faults by type
ALL REPORTED FAULTS, DISPLAYED over time and categorised by type

ALL 736 DKP Failure Faults [10]

ALL Failure faults, ORDERED by OCCURRENCE DURING 736 DKP's MOT HISTORY
ALL 736 DKP Failure Faults [10]
ALL Failure faults, ORDERED by OCCURRENCE DURING 736 DKP's MOT HISTORY
Fail Faults | source www.vehiclestats.co.uk
Fault Fault Test Date Test Date/Time Reference MOT Test Reference
1 Nearside front suspension component mounting prescribed area is excessively corroded (2.4.a.3) Nearside front suspension component mounting prescribed area is excessively corroded (2.4.a.3) 27 August 2009 [12:38] 27/08/2009 351819139288 351819139288
1 Offside front suspension component mounting prescribed area is excessively corroded (2.4.a.3) Offside front suspension component mounting prescribed area is excessively corroded (2.4.a.3) 27 August 2009 [12:38] 27/08/2009 351819139288 351819139288
1 Rear exhaust has part of the system excessively deteriorated (7.1.1a) Rear exhaust has part of the system excessively deteriorated (7.1.1a) 27 August 2009 [12:38] 27/08/2009 351819139288 351819139288
1 Offside rear suspension spring mounting prescribed area is excessively corroded (2.4.a.3) Offside rear suspension spring mounting prescribed area is excessively corroded (2.4.a.3) 27 August 2009 [12:38] 27/08/2009 351819139288 351819139288
1 Offside inner rear suspension spring mounting prescribed area is inadequately repaired (2.4.a.3) Offside inner rear suspension spring mounting prescribed area is inadequately repaired (2.4.a.3) 27 August 2009 [12:38] 27/08/2009 351819139288 351819139288
1 Nearside windscreen wiper does not clear the windscreen effectively (8.2.2) Nearside windscreen wiper does not clear the windscreen effectively (8.2.2) 27 August 2009 [12:38] 27/08/2009 351819139288 351819139288
1 Offside windscreen wiper does not clear the windscreen effectively (8.2.2) Offside windscreen wiper does not clear the windscreen effectively (8.2.2) 27 August 2009 [12:38] 27/08/2009 351819139288 351819139288
1 Parking brake: efficiency below requirements (3.7.b.7) Parking brake: efficiency below requirements (3.7.b.7) 27 August 2009 [12:38] 27/08/2009 351819139288 351819139288
1 Offside rear brake recording little or no effort (3.7.b.5a) Offside rear brake recording little or no effort (3.7.b.5a) 27 August 2009 [12:38] 27/08/2009 351819139288 351819139288
1 Offside rear parking brake recording little or no effort (3.7.b.6a) Offside rear parking brake recording little or no effort (3.7.b.6a) 27 August 2009 [12:38] 27/08/2009 351819139288 351819139288

MOT TEST: 04 September 2010 10:30:12 PASSED
MOT TEST: 04 September 2010 10:30:12 PASSED

This test (484497740258) was completed on the 04 September 2010 10:30:12 and PASSED the requirements for a valid MOT with 0 comments.

This test (484497740258) was completed on the 04 September 2010 10:30:12 and PASSED the requirements for a valid MOT with 0 comments.

Recorded mileage: 65,969

Recorded mileage: 65,969


MOT TEST: 03 September 2009 21:08:29 PASSED
MOT TEST: 03 September 2009 21:08:29 PASSED

This test (903046549259) was completed on the 03 September 2009 21:08:29 and PASSED the requirements for a valid MOT with 0 comments.

This test (903046549259) was completed on the 03 September 2009 21:08:29 and PASSED the requirements for a valid MOT with 0 comments.

Recorded mileage: 65,928

Recorded mileage: 65,928


MOT TEST: 27 August 2009 12:38:54 FAILED
MOT TEST: 27 August 2009 12:38:54 FAILED

This test (351819139288) was completed on the 27 August 2009 12:38:54 and FAILED the requirements for a valid MOT with 10 comments.

This test (351819139288) was completed on the 27 August 2009 12:38:54 and FAILED the requirements for a valid MOT with 10 comments.

Recorded mileage: 0

Recorded mileage: 0


FAIL