737 YUM


737YUM is registered to a White 1962, Morris Mini minor with a Petrol engine. It Failed its most recent MOT Test on the 21 July 2015

5 unique faults (5 Total) reported in its MOT History (5 Tests).

0 common/recurring faults.

80% (4) MOT Pass Rate and a 20% (1) MOT Failure Rate.

1,903 recorded miles.

737 YUM


737YUM is registered to a White 1962, Morris Mini minor with a Petrol engine. It Failed its most recent MOT Test on the 21 July 2015

5 unique faults (5 Total) reported in its MOT History (5 Tests).

0 common/recurring faults.

80% (4) MOT Pass Rate and a 20% (1) MOT Failure Rate.

1,903 recorded miles.

MOT PASS/Failure rate for 737 YUM

all MOT test results for 737 YUM represented as a percentage
MOT PASS/Failure rate for 737 YUM
all MOT test results for 737 YUM represented as a percentage

PERCENTAGE OF VEHICLE FAULTS WITH 737 YUM

ALL REPORTED FAULTS, DISPLAYED BY PERCENTAGE OF OCCURRENCE DURING ALL MOT TESTS
PERCENTAGE OF VEHICLE FAULTS WITH 737 YUM
ALL REPORTED FAULTS, DISPLAYED BY PERCENTAGE OF OCCURRENCE DURING ALL MOT TESTS
ADVISORY

FAIL

USER ENTERED

737 YUM annual Faults by type

ALL REPORTED FAULTS, DISPLAYED over time and categorised by type
737 YUM annual Faults by type
ALL REPORTED FAULTS, DISPLAYED over time and categorised by type

ALL 737 YUM ADVISORIES [1]

ALL ADVISORIES, ORDERED by OCCURRENCE DURING 737 YUM's MOT HISTORY
ALL 737 YUM ADVISORIES [1]
ALL ADVISORIES, ORDERED by OCCURRENCE DURING 737 YUM's MOT HISTORY
Fail Faults | source www.vehiclestats.co.uk
Fault Fault Test Date Test Date/Time Reference MOT Test Reference
1 Front exhaust has a minor leak of exhaust gases (7.1.2) Front exhaust has a minor leak of exhaust gases (7.1.2) 18 June 2013 [14:49] 18/06/2013 208189263104 208189263104

ALL 737 YUM Failure Faults [2]

ALL Failure faults, ORDERED by OCCURRENCE DURING 737 YUM's MOT HISTORY
ALL 737 YUM Failure Faults [2]
ALL Failure faults, ORDERED by OCCURRENCE DURING 737 YUM's MOT HISTORY
Fail Faults | source www.vehiclestats.co.uk
Fault Fault Test Date Test Date/Time Reference MOT Test Reference
1 Fuel system component leaking (7.2.3) Fuel system component leaking (7.2.3) 18 June 2013 [14:49] 18/06/2013 208189263104 208189263104
1 Registration plate lamp not working (1.1.c.1d) Registration plate lamp not working (1.1.c.1d) 18 June 2013 [14:49] 18/06/2013 208189263104 208189263104

ALL 737 YUM User Entered Faults [2]

ALL User Entered faults, ORDERED by OCCURRENCE DURING 737 YUM's MOT HISTORY
ALL 737 YUM User Entered Faults [2]
ALL User Entered faults, ORDERED by OCCURRENCE DURING 737 YUM's MOT HISTORY
User Entered Faults | source www.vehiclestats.co.uk
Fault Fault Test Date Test Date/Time Reference MOT Test Reference
1 Horn faulty working at time of test Horn faulty working at time of test 21 July 2015 [13:04] 21/07/2015 259052105243 259052105243
1 Oil leak Oil leak 18 June 2013 [14:49] 18/06/2013 208189263104 208189263104

MOT TEST: 21 July 2015 13:04:11 PASSED
MOT TEST: 21 July 2015 13:04:11 PASSED

This test (259052105243) was completed on the 21 July 2015 13:04:11 and PASSED the requirements for a valid MOT with 1 comments.

This test (259052105243) was completed on the 21 July 2015 13:04:11 and PASSED the requirements for a valid MOT with 1 comments.

Recorded mileage: 1,903

Recorded mileage: 1,903


USER ENTERED


MOT TEST: 29 July 2014 09:36:30 PASSED
MOT TEST: 29 July 2014 09:36:30 PASSED

This test (505260214265) was completed on the 29 July 2014 09:36:30 and PASSED the requirements for a valid MOT with 0 comments.

This test (505260214265) was completed on the 29 July 2014 09:36:30 and PASSED the requirements for a valid MOT with 0 comments.

Recorded mileage: 1,414

Recorded mileage: 1,414


MOT TEST: 26 June 2013 14:50:03 PASSED
MOT TEST: 26 June 2013 14:50:03 PASSED

This test (986467773151) was completed on the 26 June 2013 14:50:03 and PASSED the requirements for a valid MOT with 0 comments.

This test (986467773151) was completed on the 26 June 2013 14:50:03 and PASSED the requirements for a valid MOT with 0 comments.

Recorded mileage: 877

Recorded mileage: 877


MOT TEST: 18 June 2013 14:49:14 FAILED
MOT TEST: 18 June 2013 14:49:14 FAILED

This test (208189263104) was completed on the 18 June 2013 14:49:14 and FAILED the requirements for a valid MOT with 4 comments.

This test (208189263104) was completed on the 18 June 2013 14:49:14 and FAILED the requirements for a valid MOT with 4 comments.

Recorded mileage: 875

Recorded mileage: 875


ADVISORY

FAIL

USER ENTERED


MOT TEST: 27 June 2012 14:37:22 PASSED
MOT TEST: 27 June 2012 14:37:22 PASSED

This test (305759672114) was completed on the 27 June 2012 14:37:22 and PASSED the requirements for a valid MOT with 0 comments.

This test (305759672114) was completed on the 27 June 2012 14:37:22 and PASSED the requirements for a valid MOT with 0 comments.

Recorded mileage: 2

Recorded mileage: 2