738 3UN


7383UN is registered to a Cream 1963, Morris Minor 1000 with a Petrol engine. It Passed its most recent MOT Test on the 27 June 2018

39 unique faults (45 Total) reported in its MOT History (18 Tests).

6 common/recurring faults, the most frequent (2 times) is: Offside Front Brake pipe corroded, covered in grease or other material from juction (1.1.11 (c)).

67% (12) MOT Pass Rate and a 33% (6) MOT Failure Rate.

45,096 recorded miles.

738 3UN


7383UN is registered to a Cream 1963, Morris Minor 1000 with a Petrol engine. It Passed its most recent MOT Test on the 27 June 2018

39 unique faults (45 Total) reported in its MOT History (18 Tests).

6 common/recurring faults, the most frequent (2 times) is: Offside Front Brake pipe corroded, covered in grease or other material from juction (1.1.11 (c)).

67% (12) MOT Pass Rate and a 33% (6) MOT Failure Rate.

45,096 recorded miles.

MOT PASS/Failure rate for 738 3UN

all MOT test results for 738 3UN represented as a percentage
MOT PASS/Failure rate for 738 3UN
all MOT test results for 738 3UN represented as a percentage

PERCENTAGE OF VEHICLE FAULTS WITH 738 3UN

ALL REPORTED FAULTS, DISPLAYED BY PERCENTAGE OF OCCURRENCE DURING ALL MOT TESTS
PERCENTAGE OF VEHICLE FAULTS WITH 738 3UN
ALL REPORTED FAULTS, DISPLAYED BY PERCENTAGE OF OCCURRENCE DURING ALL MOT TESTS
ADVISORY

FAIL

USER ENTERED

738 3UN annual Faults by type

ALL REPORTED FAULTS, DISPLAYED over time and categorised by type
738 3UN annual Faults by type
ALL REPORTED FAULTS, DISPLAYED over time and categorised by type

RECURRING FAULTS WITH 738 3UN

FAULTS THAT HAVE OCCURED MORE THAN ONCE DURING 738 3UN's MOT HISTORY
RECURRING FAULTS WITH 738 3UN
FAULTS THAT HAVE OCCURED MORE THAN ONCE DURING 738 3UN's MOT HISTORY
Fault Fault Test Date Test Date/Time Reference MOT Test Reference
2 Offside front brake pipe corroded, covered in grease or other material from juction (1.1.11 (c)) Offside front brake pipe corroded, covered in grease or other material from juction (1.1.11 (c)) 27 June 2018 [13:34] 27/06/2018 22 June 2018 [14:31] 22/06/2018 346623187853 346623187853 756159340147 756159340147
2 Nearside front brake binding (3.7.b.1) Nearside front brake binding (3.7.b.1) 22 July 2017 [10:53] 22/07/2017 08 June 2011 [11:26] 08/06/2011 612078033992 612078033992 567889751185 567889751185
2 Parking brake: efficiency below requirements (3.7.b.7) Parking brake: efficiency below requirements (3.7.b.7) 22 July 2017 [10:53] 22/07/2017 03 July 2015 [15:23] 03/07/2015 612078033992 612078033992 476374585173 476374585173
2 Nearside front tyre heavily cracked and splitting on outer sidewall Nearside front tyre heavily cracked and splitting on outer sidewall 07 July 2015 [16:02] 07/07/2015 03 July 2015 [15:23] 03/07/2015 727808885137 727808885137 476374585173 476374585173
2 Both rear wheel bearings have slight axle oil leak Both rear wheel bearings have slight axle oil leak 07 July 2015 [16:02] 07/07/2015 03 July 2015 [15:23] 03/07/2015 727808885137 727808885137 476374585173 476374585173
2 Brakes imbalanced across an axle (3.7.b.5b) Brakes imbalanced across an axle (3.7.b.5b) 24 June 2011 [10:53] 24/06/2011 08 June 2011 [11:26] 08/06/2011 725315671139 725315671139 567889751185 567889751185

ALL 738 3UN ADVISORIES [9]

ALL ADVISORIES, ORDERED by OCCURRENCE DURING 738 3UN's MOT HISTORY
ALL 738 3UN ADVISORIES [9]
ALL ADVISORIES, ORDERED by OCCURRENCE DURING 738 3UN's MOT HISTORY
Advisory Faults | source www.vehiclestats.co.uk
Fault Fault Test Date Test Date/Time Reference MOT Test Reference
2 Offside front brake pipe corroded, covered in grease or other material from juction (1.1.11 (c)) Offside front brake pipe corroded, covered in grease or other material from juction (1.1.11 (c)) 27 June 2018 [13:34] 27/06/2018 22 June 2018 [14:31] 22/06/2018 346623187853 346623187853 756159340147 756159340147
1 Cross plys front radials rear Cross plys front radials rear 22 July 2017 [10:53] 22/07/2017 612078033992 612078033992
1 Coolant leak Coolant leak 22 July 2017 [10:53] 22/07/2017 612078033992 612078033992
1 Nearside front tyre worn close to the legal limit (4.1.e.1) Nearside front tyre worn close to the legal limit (4.1.e.1) 08 June 2011 [11:26] 08/06/2011 567889751185 567889751185
1 Offside front tyre worn close to the legal limit (4.1.e.1) Offside front tyre worn close to the legal limit (4.1.e.1) 14 October 2009 [13:32] 14/10/2009 244137889248 244137889248
1 Offside steering rack gaiter deteriorated (2.2.d.2d) Offside steering rack gaiter deteriorated (2.2.d.2d) 14 October 2009 [13:32] 14/10/2009 244137889248 244137889248
1 Nearside front headlamp damaged but light output not reduced (1.7.5a) Nearside front headlamp damaged but light output not reduced (1.7.5a) 01 June 2007 [15:36] 01/06/2007 221672357135 221672357135
1 Offside front headlamp damaged but light output not reduced (1.7.5a) Offside front headlamp damaged but light output not reduced (1.7.5a) 01 June 2007 [15:36] 01/06/2007 221672357135 221672357135

ALL 738 3UN Failure Faults [30]

ALL Failure faults, ORDERED by OCCURRENCE DURING 738 3UN's MOT HISTORY
ALL 738 3UN Failure Faults [30]
ALL Failure faults, ORDERED by OCCURRENCE DURING 738 3UN's MOT HISTORY
Fail Faults | source www.vehiclestats.co.uk
Fault Fault Test Date Test Date/Time Reference MOT Test Reference
2 Nearside front brake binding (3.7.b.1) Nearside front brake binding (3.7.b.1) 22 July 2017 [10:53] 22/07/2017 08 June 2011 [11:26] 08/06/2011 612078033992 612078033992 567889751185 567889751185
2 Parking brake: efficiency below requirements (3.7.b.7) Parking brake: efficiency below requirements (3.7.b.7) 22 July 2017 [10:53] 22/07/2017 03 July 2015 [15:23] 03/07/2015 612078033992 612078033992 476374585173 476374585173
2 Brakes imbalanced across an axle (3.7.b.5b) Brakes imbalanced across an axle (3.7.b.5b) 24 June 2011 [10:53] 24/06/2011 08 June 2011 [11:26] 08/06/2011 725315671139 725315671139 567889751185 567889751185
1 Speedometer cannot be illuminated (7.8 (c) (ii)) Speedometer cannot be illuminated (7.8 (c) (ii)) 22 June 2018 [14:31] 22/06/2018 756159340147 756159340147
1 Front brakes imbalanced across an axle (1.2.1 (b) (i)) Front brakes imbalanced across an axle (1.2.1 (b) (i)) 22 June 2018 [14:31] 22/06/2018 756159340147 756159340147
1 Service brake efficiency less than 50% of the required value (1.2.2 (a) (ii)) Service brake efficiency less than 50% of the required value (1.2.2 (a) (ii)) 22 June 2018 [14:31] 22/06/2018 756159340147 756159340147
1 Nearside track rod end ball joint has excessive play (2.2.b.1f) Nearside track rod end ball joint has excessive play (2.2.b.1f) 22 July 2017 [10:53] 22/07/2017 612078033992 612078033992
1 Offside front upper front suspension has excessive movement at a suspension ball joint trunion (2.5.a.1c) Offside front upper front suspension has excessive movement at a suspension ball joint trunion (2.5.a.1c) 22 July 2017 [10:53] 22/07/2017 612078033992 612078033992
1 Nearside front tyre has a tear, caused by separation or partial failure of its structure (4.1.d.1b) Nearside front tyre has a tear, caused by separation or partial failure of its structure (4.1.d.1b) 22 July 2017 [10:53] 22/07/2017 612078033992 612078033992
1 Offside front brake binding (3.7.b.1) Offside front brake binding (3.7.b.1) 22 July 2017 [10:53] 22/07/2017 612078033992 612078033992
1 Nearside rear brake binding (3.7.b.1) Nearside rear brake binding (3.7.b.1) 22 July 2017 [10:53] 22/07/2017 612078033992 612078033992
1 Service brake: efficiency below requirements (3.7.b.7) Service brake: efficiency below requirements (3.7.b.7) 22 July 2017 [10:53] 22/07/2017 612078033992 612078033992
1 Rear brakes imbalanced across an axle axle 2 (3.7.b.5b) Rear brakes imbalanced across an axle axle 2 (3.7.b.5b) 22 July 2017 [10:53] 22/07/2017 612078033992 612078033992
1 Front brakes imbalanced across an axle (3.7.b.5b) Front brakes imbalanced across an axle (3.7.b.5b) 03 July 2015 [15:23] 03/07/2015 476374585173 476374585173
1 Rear parking (secondary) brakes imbalanced (3.7.b.6b) Rear parking (secondary) brakes imbalanced (3.7.b.6b) 03 July 2015 [15:23] 03/07/2015 476374585173 476374585173
1 Nearside rear brake excessively fluctuating (3.7.b.3) Nearside rear brake excessively fluctuating (3.7.b.3) 03 July 2015 [15:23] 03/07/2015 476374585173 476374585173
1 Offside rear brake excessively fluctuating (3.7.b.3) Offside rear brake excessively fluctuating (3.7.b.3) 03 July 2015 [15:23] 03/07/2015 476374585173 476374585173
1 Registration plate lamp not working (1.1.c.1d) Registration plate lamp not working (1.1.c.1d) 12 July 2012 [09:32] 12/07/2012 209544292104 209544292104
1 Tyre(s) incorrect because cross-ply or bias-belted tyres are fitted on the rear axle and radial-ply tyres are fitted on the front axle. (4.1.a.2b) Tyre(s) incorrect because cross-ply or bias-belted tyres are fitted on the rear axle and radial-ply tyres are fitted on the front axle. (4.1.a.2b) 12 July 2012 [09:32] 12/07/2012 209544292104 209544292104
1 Offside stop lamp not working (1.2.1b) Offside stop lamp not working (1.2.1b) 24 June 2011 [10:53] 24/06/2011 725315671139 725315671139
1 Nearside direction indicators not working (1.4.a.2c) Nearside direction indicators not working (1.4.a.2c) 24 June 2011 [10:53] 24/06/2011 725315671139 725315671139
1 Offside direction indicators not working (1.4.a.2c) Offside direction indicators not working (1.4.a.2c) 24 June 2011 [10:53] 24/06/2011 725315671139 725315671139
1 Nearside windscreen washer provides insufficient washer liquid (8.2.3) Nearside windscreen washer provides insufficient washer liquid (8.2.3) 08 June 2011 [11:26] 08/06/2011 567889751185 567889751185
1 Offside windscreen washer provides insufficient washer liquid (8.2.3) Offside windscreen washer provides insufficient washer liquid (8.2.3) 08 June 2011 [11:26] 08/06/2011 567889751185 567889751185
1 Nearside steering rack gaiter split (2.2.d.2d) Nearside steering rack gaiter split (2.2.d.2d) 08 June 2011 [11:26] 08/06/2011 567889751185 567889751185
1 Offside steering rack gaiter split (2.2.d.2d) Offside steering rack gaiter split (2.2.d.2d) 08 June 2011 [11:26] 08/06/2011 567889751185 567889751185
1 Offside front tyre tread depth below requirements of 1.6mm (4.1.e.1) Offside front tyre tread depth below requirements of 1.6mm (4.1.e.1) 08 June 2011 [11:26] 08/06/2011 567889751185 567889751185

ALL 738 3UN User Entered Faults [6]

ALL User Entered faults, ORDERED by OCCURRENCE DURING 738 3UN's MOT HISTORY
ALL 738 3UN User Entered Faults [6]
ALL User Entered faults, ORDERED by OCCURRENCE DURING 738 3UN's MOT HISTORY
User Entered Faults | source www.vehiclestats.co.uk
Fault Fault Test Date Test Date/Time Reference MOT Test Reference
2 Nearside front tyre heavily cracked and splitting on outer sidewall Nearside front tyre heavily cracked and splitting on outer sidewall 07 July 2015 [16:02] 07/07/2015 03 July 2015 [15:23] 03/07/2015 727808885137 727808885137 476374585173 476374585173
2 Both rear wheel bearings have slight axle oil leak Both rear wheel bearings have slight axle oil leak 07 July 2015 [16:02] 07/07/2015 03 July 2015 [15:23] 03/07/2015 727808885137 727808885137 476374585173 476374585173
1 Condition of front tyres [sidewalls] Condition of front tyres [sidewalls] 24 April 2013 [09:56] 24/04/2013 396034413182 396034413182
1 Cracks in between tread of nearside front tyre Cracks in between tread of nearside front tyre 08 June 2011 [11:26] 08/06/2011 567889751185 567889751185

MOT TEST: 27 June 2018 13:34:32 PASSED
MOT TEST: 27 June 2018 13:34:32 PASSED

This test (346623187853) was completed on the 27 June 2018 13:34:32 and PASSED the requirements for a valid MOT with 1 comments.

This test (346623187853) was completed on the 27 June 2018 13:34:32 and PASSED the requirements for a valid MOT with 1 comments.

Recorded mileage: 45,096

Recorded mileage: 45,096


ADVISORY


MOT TEST: 22 June 2018 14:31:11 FAILED
MOT TEST: 22 June 2018 14:31:11 FAILED

This test (756159340147) was completed on the 22 June 2018 14:31:11 and FAILED the requirements for a valid MOT with 4 comments.

This test (756159340147) was completed on the 22 June 2018 14:31:11 and FAILED the requirements for a valid MOT with 4 comments.

Recorded mileage: 45,096

Recorded mileage: 45,096


ADVISORY

FAIL


MOT TEST: 29 September 2017 12:10:19 PASSED
MOT TEST: 29 September 2017 12:10:19 PASSED

This test (375768500535) was completed on the 29 September 2017 12:10:19 and PASSED the requirements for a valid MOT with 0 comments.

This test (375768500535) was completed on the 29 September 2017 12:10:19 and PASSED the requirements for a valid MOT with 0 comments.

Recorded mileage: 44,961

Recorded mileage: 44,961


MOT TEST: 22 July 2017 10:53:34 FAILED
MOT TEST: 22 July 2017 10:53:34 FAILED

This test (612078033992) was completed on the 22 July 2017 10:53:34 and FAILED the requirements for a valid MOT with 11 comments.

This test (612078033992) was completed on the 22 July 2017 10:53:34 and FAILED the requirements for a valid MOT with 11 comments.

Recorded mileage: 44,961

Recorded mileage: 44,961


ADVISORY

FAIL


MOT TEST: 25 July 2016 08:15:54 PASSED
MOT TEST: 25 July 2016 08:15:54 PASSED

This test (931739293642) was completed on the 25 July 2016 08:15:54 and PASSED the requirements for a valid MOT with 0 comments.

This test (931739293642) was completed on the 25 July 2016 08:15:54 and PASSED the requirements for a valid MOT with 0 comments.

Recorded mileage: 44,733

Recorded mileage: 44,733


MOT TEST: 07 July 2015 16:02:01 PASSED
MOT TEST: 07 July 2015 16:02:01 PASSED

This test (727808885137) was completed on the 07 July 2015 16:02:01 and PASSED the requirements for a valid MOT with 2 comments.

This test (727808885137) was completed on the 07 July 2015 16:02:01 and PASSED the requirements for a valid MOT with 2 comments.

Recorded mileage: 44,454

Recorded mileage: 44,454


USER ENTERED


MOT TEST: 03 July 2015 15:23:07 FAILED
MOT TEST: 03 July 2015 15:23:07 FAILED

This test (476374585173) was completed on the 03 July 2015 15:23:07 and FAILED the requirements for a valid MOT with 7 comments.

This test (476374585173) was completed on the 03 July 2015 15:23:07 and FAILED the requirements for a valid MOT with 7 comments.

Recorded mileage: 44,447

Recorded mileage: 44,447


FAIL

USER ENTERED


MOT TEST: 23 June 2014 14:21:17 PASSED
MOT TEST: 23 June 2014 14:21:17 PASSED

This test (528324974189) was completed on the 23 June 2014 14:21:17 and PASSED the requirements for a valid MOT with 0 comments.

This test (528324974189) was completed on the 23 June 2014 14:21:17 and PASSED the requirements for a valid MOT with 0 comments.

Recorded mileage: 43,925

Recorded mileage: 43,925


MOT TEST: 24 April 2013 09:56:42 PASSED
MOT TEST: 24 April 2013 09:56:42 PASSED

This test (396034413182) was completed on the 24 April 2013 09:56:42 and PASSED the requirements for a valid MOT with 1 comments.

This test (396034413182) was completed on the 24 April 2013 09:56:42 and PASSED the requirements for a valid MOT with 1 comments.

Recorded mileage: 43,757

Recorded mileage: 43,757


USER ENTERED


MOT TEST: 12 July 2012 16:34:02 PASSED
MOT TEST: 12 July 2012 16:34:02 PASSED

This test (266464292441) was completed on the 12 July 2012 16:34:02 and PASSED the requirements for a valid MOT with 0 comments.

This test (266464292441) was completed on the 12 July 2012 16:34:02 and PASSED the requirements for a valid MOT with 0 comments.

Recorded mileage: 43,584

Recorded mileage: 43,584


MOT TEST: 12 July 2012 09:32:34 FAILED
MOT TEST: 12 July 2012 09:32:34 FAILED

This test (209544292104) was completed on the 12 July 2012 09:32:34 and FAILED the requirements for a valid MOT with 2 comments.

This test (209544292104) was completed on the 12 July 2012 09:32:34 and FAILED the requirements for a valid MOT with 2 comments.

Recorded mileage: 43,584

Recorded mileage: 43,584


FAIL


MOT TEST: 24 June 2011 15:19:05 PASSED
MOT TEST: 24 June 2011 15:19:05 PASSED

This test (657675871149) was completed on the 24 June 2011 15:19:05 and PASSED the requirements for a valid MOT with 0 comments.

This test (657675871149) was completed on the 24 June 2011 15:19:05 and PASSED the requirements for a valid MOT with 0 comments.

Recorded mileage: 43,087

Recorded mileage: 43,087


MOT TEST: 24 June 2011 10:53:06 FAILED
MOT TEST: 24 June 2011 10:53:06 FAILED

This test (725315671139) was completed on the 24 June 2011 10:53:06 and FAILED the requirements for a valid MOT with 4 comments.

This test (725315671139) was completed on the 24 June 2011 10:53:06 and FAILED the requirements for a valid MOT with 4 comments.

Recorded mileage: 43,081

Recorded mileage: 43,081


FAIL


MOT TEST: 08 June 2011 11:26:53 FAILED
MOT TEST: 08 June 2011 11:26:53 FAILED

This test (567889751185) was completed on the 08 June 2011 11:26:53 and FAILED the requirements for a valid MOT with 9 comments.

This test (567889751185) was completed on the 08 June 2011 11:26:53 and FAILED the requirements for a valid MOT with 9 comments.

Recorded mileage: 43,077

Recorded mileage: 43,077


ADVISORY

FAIL

USER ENTERED


MOT TEST: 14 October 2009 13:32:14 PASSED
MOT TEST: 14 October 2009 13:32:14 PASSED

This test (244137889248) was completed on the 14 October 2009 13:32:14 and PASSED the requirements for a valid MOT with 2 comments.

This test (244137889248) was completed on the 14 October 2009 13:32:14 and PASSED the requirements for a valid MOT with 2 comments.

Recorded mileage: 42,754

Recorded mileage: 42,754


ADVISORY


MOT TEST: 17 July 2008 09:59:16 PASSED
MOT TEST: 17 July 2008 09:59:16 PASSED

This test (921189998121) was completed on the 17 July 2008 09:59:16 and PASSED the requirements for a valid MOT with 0 comments.

This test (921189998121) was completed on the 17 July 2008 09:59:16 and PASSED the requirements for a valid MOT with 0 comments.

Recorded mileage: 42,513

Recorded mileage: 42,513


MOT TEST: 01 June 2007 15:36:56 PASSED
MOT TEST: 01 June 2007 15:36:56 PASSED

This test (221672357135) was completed on the 01 June 2007 15:36:56 and PASSED the requirements for a valid MOT with 2 comments.

This test (221672357135) was completed on the 01 June 2007 15:36:56 and PASSED the requirements for a valid MOT with 2 comments.

Recorded mileage: 42,471

Recorded mileage: 42,471


ADVISORY


MOT TEST: 26 January 2006 11:02:06 PASSED
MOT TEST: 26 January 2006 11:02:06 PASSED

This test (583746326002) was completed on the 26 January 2006 11:02:06 and PASSED the requirements for a valid MOT with 0 comments.

This test (583746326002) was completed on the 26 January 2006 11:02:06 and PASSED the requirements for a valid MOT with 0 comments.

Recorded mileage: 42,461

Recorded mileage: 42,461