740 UXG


740UXG is registered to a Grey 1971, Morris Minor with a Petrol engine. It Failed its most recent MOT Test on the 08 July 2016

9 unique faults (10 Total) reported in its MOT History (5 Tests).

1 common/recurring faults.

60% (3) MOT Pass Rate and a 40% (2) MOT Failure Rate.

69,773 recorded miles.

740 UXG


740UXG is registered to a Grey 1971, Morris Minor with a Petrol engine. It Failed its most recent MOT Test on the 08 July 2016

9 unique faults (10 Total) reported in its MOT History (5 Tests).

1 common/recurring faults.

60% (3) MOT Pass Rate and a 40% (2) MOT Failure Rate.

69,773 recorded miles.

MOT PASS/Failure rate for 740 UXG

all MOT test results for 740 UXG represented as a percentage
MOT PASS/Failure rate for 740 UXG
all MOT test results for 740 UXG represented as a percentage

PERCENTAGE OF VEHICLE FAULTS WITH 740 UXG

ALL REPORTED FAULTS, DISPLAYED BY PERCENTAGE OF OCCURRENCE DURING ALL MOT TESTS
PERCENTAGE OF VEHICLE FAULTS WITH 740 UXG
ALL REPORTED FAULTS, DISPLAYED BY PERCENTAGE OF OCCURRENCE DURING ALL MOT TESTS
ADVISORY

FAIL

740 UXG annual Faults by type

ALL REPORTED FAULTS, DISPLAYED over time and categorised by type
740 UXG annual Faults by type
ALL REPORTED FAULTS, DISPLAYED over time and categorised by type

ALL 740 UXG ADVISORIES [3]

ALL ADVISORIES, ORDERED by OCCURRENCE DURING 740 UXG's MOT HISTORY
ALL 740 UXG ADVISORIES [3]
ALL ADVISORIES, ORDERED by OCCURRENCE DURING 740 UXG's MOT HISTORY
Advisory Faults | source www.vehiclestats.co.uk
Fault Fault Test Date Test Date/Time Reference MOT Test Reference
2 Offside front upper suspension arm has slight play in a pin/bush bush (2.4.g.2) Offside front upper suspension arm has slight play in a pin/bush bush (2.4.g.2) 08 July 2016 [11:45] 08/07/2016 28 June 2016 [12:34] 28/06/2016 422948071526 422948071526 820259611330 820259611330
1 Nearside front wheel bearing has slight play (2.5.a.3c) Nearside front wheel bearing has slight play (2.5.a.3c) 24 April 2010 [08:34] 24/04/2010 241974410187 241974410187

ALL 740 UXG Failure Faults [7]

ALL Failure faults, ORDERED by OCCURRENCE DURING 740 UXG's MOT HISTORY
ALL 740 UXG Failure Faults [7]
ALL Failure faults, ORDERED by OCCURRENCE DURING 740 UXG's MOT HISTORY
Fail Faults | source www.vehiclestats.co.uk
Fault Fault Test Date Test Date/Time Reference MOT Test Reference
1 Parking brake: efficiency below requirements (3.7.c.1b) Parking brake: efficiency below requirements (3.7.c.1b) 28 June 2016 [12:34] 28/06/2016 820259611330 820259611330
1 Offside body or chassis has excessive corrosion, seriously affecting its strength within 30cm of the body mountings inner seal (6.1.b.2) Offside body or chassis has excessive corrosion, seriously affecting its strength within 30cm of the body mountings inner seal (6.1.b.2) 28 June 2016 [12:34] 28/06/2016 820259611330 820259611330
1 Offside front tie bar/rod has excessive play in a pin/bush (2.4.g.2) Offside front tie bar/rod has excessive play in a pin/bush (2.4.g.2) 28 June 2016 [12:34] 28/06/2016 820259611330 820259611330
1 Nearside front front brake recording little or no effort (3.7.b.5a) Nearside front front brake recording little or no effort (3.7.b.5a) 30 January 2010 [11:20] 30/01/2010 433990530017 433990530017
1 Front front brake application uneven (3.7.b.2) Front front brake application uneven (3.7.b.2) 30 January 2010 [11:20] 30/01/2010 433990530017 433990530017
1 Rear brake application uneven (3.7.b.2) Rear brake application uneven (3.7.b.2) 30 January 2010 [11:20] 30/01/2010 433990530017 433990530017
1 Service brake: efficiency below requirements (3.7.b.7) Service brake: efficiency below requirements (3.7.b.7) 30 January 2010 [11:20] 30/01/2010 433990530017 433990530017

MOT TEST: 08 July 2016 11:45:37 PASSED
MOT TEST: 08 July 2016 11:45:37 PASSED

This test (422948071526) was completed on the 08 July 2016 11:45:37 and PASSED the requirements for a valid MOT with 1 comments.

This test (422948071526) was completed on the 08 July 2016 11:45:37 and PASSED the requirements for a valid MOT with 1 comments.

Recorded mileage: 69,773

Recorded mileage: 69,773


ADVISORY


MOT TEST: 28 June 2016 12:34:47 FAILED
MOT TEST: 28 June 2016 12:34:47 FAILED

This test (820259611330) was completed on the 28 June 2016 12:34:47 and FAILED the requirements for a valid MOT with 4 comments.

This test (820259611330) was completed on the 28 June 2016 12:34:47 and FAILED the requirements for a valid MOT with 4 comments.

Recorded mileage: 69,771

Recorded mileage: 69,771


ADVISORY

FAIL


MOT TEST: 24 April 2010 08:34:37 PASSED
MOT TEST: 24 April 2010 08:34:37 PASSED

This test (241974410187) was completed on the 24 April 2010 08:34:37 and PASSED the requirements for a valid MOT with 1 comments.

This test (241974410187) was completed on the 24 April 2010 08:34:37 and PASSED the requirements for a valid MOT with 1 comments.

Recorded mileage: 68,162

Recorded mileage: 68,162


ADVISORY


MOT TEST: 30 January 2010 11:20:40 FAILED
MOT TEST: 30 January 2010 11:20:40 FAILED

This test (433990530017) was completed on the 30 January 2010 11:20:40 and FAILED the requirements for a valid MOT with 4 comments.

This test (433990530017) was completed on the 30 January 2010 11:20:40 and FAILED the requirements for a valid MOT with 4 comments.

Recorded mileage: 68,156

Recorded mileage: 68,156


FAIL


MOT TEST: 11 February 2009 12:45:36 PASSED
MOT TEST: 11 February 2009 12:45:36 PASSED

This test (973322649054) was completed on the 11 February 2009 12:45:36 and PASSED the requirements for a valid MOT with 0 comments.

This test (973322649054) was completed on the 11 February 2009 12:45:36 and PASSED the requirements for a valid MOT with 0 comments.

Recorded mileage: 67,884

Recorded mileage: 67,884