741 LYA


741LYA is registered to a White 1961, Morris Mini with a Petrol engine. It Passed its most recent MOT Test on the 14 August 2018

15 unique faults (17 Total) reported in its MOT History (13 Tests).

2 common/recurring faults, the most frequent (2 times) is: Parking brake: parking brake efficiency only just met. It would appear that the braking system requires adjustment or repair. (3.7.C.1b).

69% (9) MOT Pass Rate and a 31% (4) MOT Failure Rate.

68,984 recorded miles.

741 LYA


741LYA is registered to a White 1961, Morris Mini with a Petrol engine. It Passed its most recent MOT Test on the 14 August 2018

15 unique faults (17 Total) reported in its MOT History (13 Tests).

2 common/recurring faults, the most frequent (2 times) is: Parking brake: parking brake efficiency only just met. It would appear that the braking system requires adjustment or repair. (3.7.C.1b).

69% (9) MOT Pass Rate and a 31% (4) MOT Failure Rate.

68,984 recorded miles.

MOT PASS/Failure rate for 741 LYA

all MOT test results for 741 LYA represented as a percentage
MOT PASS/Failure rate for 741 LYA
all MOT test results for 741 LYA represented as a percentage

PERCENTAGE OF VEHICLE FAULTS WITH 741 LYA

ALL REPORTED FAULTS, DISPLAYED BY PERCENTAGE OF OCCURRENCE DURING ALL MOT TESTS
PERCENTAGE OF VEHICLE FAULTS WITH 741 LYA
ALL REPORTED FAULTS, DISPLAYED BY PERCENTAGE OF OCCURRENCE DURING ALL MOT TESTS
ADVISORY

FAIL

USER ENTERED

PASS WITH RECTIFICATION

741 LYA annual Faults by type

ALL REPORTED FAULTS, DISPLAYED over time and categorised by type
741 LYA annual Faults by type
ALL REPORTED FAULTS, DISPLAYED over time and categorised by type

RECURRING FAULTS WITH 741 LYA

FAULTS THAT HAVE OCCURED MORE THAN ONCE DURING 741 LYA's MOT HISTORY
RECURRING FAULTS WITH 741 LYA
FAULTS THAT HAVE OCCURED MORE THAN ONCE DURING 741 LYA's MOT HISTORY
Fault Fault Test Date Test Date/Time Reference MOT Test Reference
2 Parking brake: parking brake efficiency only just met. It would appear that the braking system requires adjustment or repair. (3.7.c.1b) Parking brake: parking brake efficiency only just met. It would appear that the braking system requires adjustment or repair. (3.7.c.1b) 27 September 2010 [16:49] 27/09/2010 27 September 2010 [16:49] 27/09/2010 543100970234 543100970234 213340570229 213340570229
2 Some play steering rack nearside end bush Some play steering rack nearside end bush 27 September 2010 [16:49] 27/09/2010 27 September 2010 [16:49] 27/09/2010 543100970234 543100970234 213340570229 213340570229

ALL 741 LYA ADVISORIES [2]

ALL ADVISORIES, ORDERED by OCCURRENCE DURING 741 LYA's MOT HISTORY
ALL 741 LYA ADVISORIES [2]
ALL ADVISORIES, ORDERED by OCCURRENCE DURING 741 LYA's MOT HISTORY
Advisory Faults | source www.vehiclestats.co.uk
Fault Fault Test Date Test Date/Time Reference MOT Test Reference
2 Parking brake: parking brake efficiency only just met. It would appear that the braking system requires adjustment or repair. (3.7.c.1b) Parking brake: parking brake efficiency only just met. It would appear that the braking system requires adjustment or repair. (3.7.c.1b) 27 September 2010 [16:49] 27/09/2010 27 September 2010 [16:49] 27/09/2010 543100970234 543100970234 213340570229 213340570229

ALL 741 LYA Failure Faults [11]

ALL Failure faults, ORDERED by OCCURRENCE DURING 741 LYA's MOT HISTORY
ALL 741 LYA Failure Faults [11]
ALL Failure faults, ORDERED by OCCURRENCE DURING 741 LYA's MOT HISTORY
Fail Faults | source www.vehiclestats.co.uk
Fault Fault Test Date Test Date/Time Reference MOT Test Reference
1 Windscreen washer provides insufficient washer liquid (3.5 (a)) Windscreen washer provides insufficient washer liquid (3.5 (a)) 14 August 2018 [10:02] 14/08/2018 821190207934 821190207934
1 Nearside headlamp not working on dipped beam (4.1.1 (a) (ii)) Nearside headlamp not working on dipped beam (4.1.1 (a) (ii)) 14 August 2018 [10:02] 14/08/2018 821190207934 821190207934
1 Nearside rear tyre tread depth below requirements of 1.6mm (5.2.3 (e)) Nearside rear tyre tread depth below requirements of 1.6mm (5.2.3 (e)) 14 August 2018 [10:02] 14/08/2018 821190207934 821190207934
1 Service brake: efficiency below requirements (3.7.b.7) Service brake: efficiency below requirements (3.7.b.7) 14 August 2017 [12:41] 14/08/2017 474980056733 474980056733
1 Parking brake: efficiency below requirements (3.7.b.7) Parking brake: efficiency below requirements (3.7.b.7) 14 August 2017 [12:41] 14/08/2017 474980056733 474980056733
1 Front passenger door cannot be opened from inside the vehicle (6.2.b.1b) Front passenger door cannot be opened from inside the vehicle (6.2.b.1b) 14 August 2017 [12:41] 14/08/2017 474980056733 474980056733
1 Front passenger door cannot be opened from outside the vehicle (6.2.b.1b) Front passenger door cannot be opened from outside the vehicle (6.2.b.1b) 14 August 2017 [12:41] 14/08/2017 474980056733 474980056733
1 Battery insecure (1.9.1) Battery insecure (1.9.1) 14 August 2017 [12:41] 14/08/2017 474980056733 474980056733
1 Rear position lamp(s) excessively deteriorated so that it is not visible from a reasonable distance off side and near side (1.1.a.3d) Rear position lamp(s) excessively deteriorated so that it is not visible from a reasonable distance off side and near side (1.1.a.3d) 14 August 2017 [12:41] 14/08/2017 474980056733 474980056733
1 Indicator tell tale inoperative (1.4.a.2a) Indicator tell tale inoperative (1.4.a.2a) 14 August 2017 [12:41] 14/08/2017 474980056733 474980056733
1 Stop lamp not working (1.2.1b) Stop lamp not working (1.2.1b) 12 August 2014 [17:26] 12/08/2014 409754524259 409754524259

ALL 741 LYA User Entered Faults [3]

ALL User Entered faults, ORDERED by OCCURRENCE DURING 741 LYA's MOT HISTORY
ALL 741 LYA User Entered Faults [3]
ALL User Entered faults, ORDERED by OCCURRENCE DURING 741 LYA's MOT HISTORY
Advisory Faults | source www.vehiclestats.co.uk
Fault Fault Test Date Test Date/Time Reference MOT Test Reference
2 Some play steering rack nearside end bush Some play steering rack nearside end bush 27 September 2010 [16:49] 27/09/2010 27 September 2010 [16:49] 27/09/2010 543100970234 543100970234 213340570229 213340570229
1 Play in nearside steering rack arm Play in nearside steering rack arm 19 September 2011 [15:11] 19/09/2011 958862061289 958862061289

ALL 741 LYA Pass With Rectification Faults [1]

ALL Pass With Rectification faults, ORDERED by OCCURRENCE DURING 741 LYA's MOT HISTORY
ALL 741 LYA Pass With Rectification Faults [1]
ALL Pass With Rectification faults, ORDERED by OCCURRENCE DURING 741 LYA's MOT HISTORY
Pass With Rectification Faults | source www.vehiclestats.co.uk
Fault Fault Test Date Test Date/Time Reference MOT Test Reference
1 Offside rear tyre tread depth below requirements of 1.6mm (4.1.e.1) Offside rear tyre tread depth below requirements of 1.6mm (4.1.e.1) 27 September 2010 [16:49] 27/09/2010 213340570229 213340570229

MOT TEST: 14 August 2018 15:37:05 PASSED
MOT TEST: 14 August 2018 15:37:05 PASSED

This test (568290879303) was completed on the 14 August 2018 15:37:05 and PASSED the requirements for a valid MOT with 0 comments.

This test (568290879303) was completed on the 14 August 2018 15:37:05 and PASSED the requirements for a valid MOT with 0 comments.

Recorded mileage: 68,984

Recorded mileage: 68,984


MOT TEST: 14 August 2018 10:02:07 FAILED
MOT TEST: 14 August 2018 10:02:07 FAILED

This test (821190207934) was completed on the 14 August 2018 10:02:07 and FAILED the requirements for a valid MOT with 3 comments.

This test (821190207934) was completed on the 14 August 2018 10:02:07 and FAILED the requirements for a valid MOT with 3 comments.

Recorded mileage: 68,984

Recorded mileage: 68,984


FAIL


MOT TEST: 17 August 2017 13:46:29 PASSED
MOT TEST: 17 August 2017 13:46:29 PASSED

This test (180752921522) was completed on the 17 August 2017 13:46:29 and PASSED the requirements for a valid MOT with 0 comments.

This test (180752921522) was completed on the 17 August 2017 13:46:29 and PASSED the requirements for a valid MOT with 0 comments.

Recorded mileage: 68,166

Recorded mileage: 68,166


MOT TEST: 14 August 2017 12:41:50 FAILED
MOT TEST: 14 August 2017 12:41:50 FAILED

This test (474980056733) was completed on the 14 August 2017 12:41:50 and FAILED the requirements for a valid MOT with 7 comments.

This test (474980056733) was completed on the 14 August 2017 12:41:50 and FAILED the requirements for a valid MOT with 7 comments.

Recorded mileage: 68,166

Recorded mileage: 68,166


FAIL


MOT TEST: 25 August 2016 09:32:14 PASSED
MOT TEST: 25 August 2016 09:32:14 PASSED

This test (989182359192) was completed on the 25 August 2016 09:32:14 and PASSED the requirements for a valid MOT with 0 comments.

This test (989182359192) was completed on the 25 August 2016 09:32:14 and PASSED the requirements for a valid MOT with 0 comments.

Recorded mileage: 67,048

Recorded mileage: 67,048


MOT TEST: 04 September 2015 12:49:10 PASSED
MOT TEST: 04 September 2015 12:49:10 PASSED

This test (107054882591) was completed on the 04 September 2015 12:49:10 and PASSED the requirements for a valid MOT with 0 comments.

This test (107054882591) was completed on the 04 September 2015 12:49:10 and PASSED the requirements for a valid MOT with 0 comments.

Recorded mileage: 65,915

Recorded mileage: 65,915


MOT TEST: 14 August 2014 15:07:14 PASSED
MOT TEST: 14 August 2014 15:07:14 PASSED

This test (167266224224) was completed on the 14 August 2014 15:07:14 and PASSED the requirements for a valid MOT with 0 comments.

This test (167266224224) was completed on the 14 August 2014 15:07:14 and PASSED the requirements for a valid MOT with 0 comments.

Recorded mileage: 64,515

Recorded mileage: 64,515


MOT TEST: 12 August 2014 17:26:07 FAILED
MOT TEST: 12 August 2014 17:26:07 FAILED

This test (409754524259) was completed on the 12 August 2014 17:26:07 and FAILED the requirements for a valid MOT with 1 comments.

This test (409754524259) was completed on the 12 August 2014 17:26:07 and FAILED the requirements for a valid MOT with 1 comments.

Recorded mileage: 64,515

Recorded mileage: 64,515


FAIL


MOT TEST: 27 August 2013 10:52:39 PASSED
MOT TEST: 27 August 2013 10:52:39 PASSED

This test (615559533284) was completed on the 27 August 2013 10:52:39 and PASSED the requirements for a valid MOT with 0 comments.

This test (615559533284) was completed on the 27 August 2013 10:52:39 and PASSED the requirements for a valid MOT with 0 comments.

Recorded mileage: 63,473

Recorded mileage: 63,473


MOT TEST: 05 September 2012 15:06:52 PASSED
MOT TEST: 05 September 2012 15:06:52 PASSED

This test (235179942280) was completed on the 05 September 2012 15:06:52 and PASSED the requirements for a valid MOT with 0 comments.

This test (235179942280) was completed on the 05 September 2012 15:06:52 and PASSED the requirements for a valid MOT with 0 comments.

Recorded mileage: 62,607

Recorded mileage: 62,607


MOT TEST: 19 September 2011 15:11:59 PASSED
MOT TEST: 19 September 2011 15:11:59 PASSED

This test (958862061289) was completed on the 19 September 2011 15:11:59 and PASSED the requirements for a valid MOT with 1 comments.

This test (958862061289) was completed on the 19 September 2011 15:11:59 and PASSED the requirements for a valid MOT with 1 comments.

Recorded mileage: 62,002

Recorded mileage: 62,002


USER ENTERED


MOT TEST: 27 September 2010 16:49:26 PASSED
MOT TEST: 27 September 2010 16:49:26 PASSED

This test (543100970234) was completed on the 27 September 2010 16:49:26 and PASSED the requirements for a valid MOT with 2 comments.

This test (543100970234) was completed on the 27 September 2010 16:49:26 and PASSED the requirements for a valid MOT with 2 comments.

Recorded mileage: 61,431

Recorded mileage: 61,431


ADVISORY

USER ENTERED


MOT TEST: 27 September 2010 16:49:26 FAILED
MOT TEST: 27 September 2010 16:49:26 FAILED

This test (213340570229) was completed on the 27 September 2010 16:49:26 and FAILED the requirements for a valid MOT with 3 comments.

This test (213340570229) was completed on the 27 September 2010 16:49:26 and FAILED the requirements for a valid MOT with 3 comments.

Recorded mileage: 61,431

Recorded mileage: 61,431


ADVISORY

USER ENTERED

PASS WITH RECTIFICATION