742 2WD


7422WD is registered to a White 1961, Morris Minor 1000 with a Petrol engine. It Failed its most recent MOT Test on the 22 July 2013

6 unique faults (6 Total) reported in its MOT History (4 Tests).

0 common/recurring faults.

75% (3) MOT Pass Rate and a 25% (1) MOT Failure Rate.

25,858 recorded miles.

742 2WD


7422WD is registered to a White 1961, Morris Minor 1000 with a Petrol engine. It Failed its most recent MOT Test on the 22 July 2013

6 unique faults (6 Total) reported in its MOT History (4 Tests).

0 common/recurring faults.

75% (3) MOT Pass Rate and a 25% (1) MOT Failure Rate.

25,858 recorded miles.

MOT PASS/Failure rate for 742 2WD

all MOT test results for 742 2WD represented as a percentage
MOT PASS/Failure rate for 742 2WD
all MOT test results for 742 2WD represented as a percentage

PERCENTAGE OF VEHICLE FAULTS WITH 742 2WD

ALL REPORTED FAULTS, DISPLAYED BY PERCENTAGE OF OCCURRENCE DURING ALL MOT TESTS
PERCENTAGE OF VEHICLE FAULTS WITH 742 2WD
ALL REPORTED FAULTS, DISPLAYED BY PERCENTAGE OF OCCURRENCE DURING ALL MOT TESTS
FAIL

USER ENTERED

742 2WD annual Faults by type

ALL REPORTED FAULTS, DISPLAYED over time and categorised by type
742 2WD annual Faults by type
ALL REPORTED FAULTS, DISPLAYED over time and categorised by type

ALL 742 2WD Failure Faults [3]

ALL Failure faults, ORDERED by OCCURRENCE DURING 742 2WD's MOT HISTORY
ALL 742 2WD Failure Faults [3]
ALL Failure faults, ORDERED by OCCURRENCE DURING 742 2WD's MOT HISTORY
Fail Faults | source www.vehiclestats.co.uk
Fault Fault Test Date Test Date/Time Reference MOT Test Reference
1 Drivers seat insecure (6.2.a.1) Drivers seat insecure (6.2.a.1) 20 June 2012 [16:06] 20/06/2012 537192272185 537192272185
1 Front passengers seat insecure (6.2.a.1) Front passengers seat insecure (6.2.a.1) 20 June 2012 [16:06] 20/06/2012 537192272185 537192272185
1 Fuel cap/sealing device sealing washer missing (7.2.4c) Fuel cap/sealing device sealing washer missing (7.2.4c) 20 June 2012 [16:06] 20/06/2012 537192272185 537192272185

ALL 742 2WD User Entered Faults [3]

ALL User Entered faults, ORDERED by OCCURRENCE DURING 742 2WD's MOT HISTORY
ALL 742 2WD User Entered Faults [3]
ALL User Entered faults, ORDERED by OCCURRENCE DURING 742 2WD's MOT HISTORY
Fail Faults | source www.vehiclestats.co.uk
Fault Fault Test Date Test Date/Time Reference MOT Test Reference
1 Clutch pedal anti slip missing Clutch pedal anti slip missing 20 June 2012 [16:06] 20/06/2012 537192272185 537192272185
1 Speedometer illuminates 50% Speedometer illuminates 50% 20 June 2012 [16:06] 20/06/2012 537192272185 537192272185
1 N.s rear brake slight bind N.s rear brake slight bind 20 June 2012 [16:06] 20/06/2012 537192272185 537192272185

MOT TEST: 22 July 2013 13:25:05 PASSED
MOT TEST: 22 July 2013 13:25:05 PASSED

This test (497953203220) was completed on the 22 July 2013 13:25:05 and PASSED the requirements for a valid MOT with 0 comments.

This test (497953203220) was completed on the 22 July 2013 13:25:05 and PASSED the requirements for a valid MOT with 0 comments.

Recorded mileage: 25,858

Recorded mileage: 25,858


MOT TEST: 27 June 2012 10:26:10 PASSED
MOT TEST: 27 June 2012 10:26:10 PASSED

This test (265029872153) was completed on the 27 June 2012 10:26:10 and PASSED the requirements for a valid MOT with 0 comments.

This test (265029872153) was completed on the 27 June 2012 10:26:10 and PASSED the requirements for a valid MOT with 0 comments.

Recorded mileage: 25,765

Recorded mileage: 25,765


MOT TEST: 20 June 2012 16:06:00 FAILED
MOT TEST: 20 June 2012 16:06:00 FAILED

This test (537192272185) was completed on the 20 June 2012 16:06:00 and FAILED the requirements for a valid MOT with 6 comments.

This test (537192272185) was completed on the 20 June 2012 16:06:00 and FAILED the requirements for a valid MOT with 6 comments.

Recorded mileage: 25,758

Recorded mileage: 25,758


FAIL

USER ENTERED


MOT TEST: 13 June 2011 12:11:54 PASSED
MOT TEST: 13 June 2011 12:11:54 PASSED

This test (787204961149) was completed on the 13 June 2011 12:11:54 and PASSED the requirements for a valid MOT with 0 comments.

This test (787204961149) was completed on the 13 June 2011 12:11:54 and PASSED the requirements for a valid MOT with 0 comments.

Recorded mileage: 25,729

Recorded mileage: 25,729