742 XUH


742XUH is registered to a Grey 1961, Morris Minor with a Petrol engine. It Failed its most recent MOT Test on the 08 March 2013

10 unique faults (11 Total) reported in its MOT History (1 Tests).

0 common/recurring faults.

0% (0) MOT Pass Rate and a 100% (1) MOT Failure Rate.

62,836 recorded miles.

742 XUH


742XUH is registered to a Grey 1961, Morris Minor with a Petrol engine. It Failed its most recent MOT Test on the 08 March 2013

10 unique faults (11 Total) reported in its MOT History (1 Tests).

0 common/recurring faults.

0% (0) MOT Pass Rate and a 100% (1) MOT Failure Rate.

62,836 recorded miles.

MOT PASS/Failure rate for 742 XUH

all MOT test results for 742 XUH represented as a percentage
MOT PASS/Failure rate for 742 XUH
all MOT test results for 742 XUH represented as a percentage

PERCENTAGE OF VEHICLE FAULTS WITH 742 XUH

ALL REPORTED FAULTS, DISPLAYED BY PERCENTAGE OF OCCURRENCE DURING ALL MOT TESTS
PERCENTAGE OF VEHICLE FAULTS WITH 742 XUH
ALL REPORTED FAULTS, DISPLAYED BY PERCENTAGE OF OCCURRENCE DURING ALL MOT TESTS
FAIL

742 XUH annual Faults by type

ALL REPORTED FAULTS, DISPLAYED over time and categorised by type
742 XUH annual Faults by type
ALL REPORTED FAULTS, DISPLAYED over time and categorised by type

ALL 742 XUH Failure Faults [11]

ALL Failure faults, ORDERED by OCCURRENCE DURING 742 XUH's MOT HISTORY
ALL 742 XUH Failure Faults [11]
ALL Failure faults, ORDERED by OCCURRENCE DURING 742 XUH's MOT HISTORY
Fail Faults | source www.vehiclestats.co.uk
Fault Fault Test Date Test Date/Time Reference MOT Test Reference
1 Parking brake: efficiency below requirements (3.7.b.7) Parking brake: efficiency below requirements (3.7.b.7) 08 March 2013 [16:40] 08/03/2013 117087163420 117087163420
1 Offside rear brake recording little or no effort (3.7.b.5a) Offside rear brake recording little or no effort (3.7.b.5a) 08 March 2013 [16:40] 08/03/2013 117087163420 117087163420
1 Nearside headlamp not working on dipped beam (1.7.5a) Nearside headlamp not working on dipped beam (1.7.5a) 08 March 2013 [16:40] 08/03/2013 117087163420 117087163420
1 Offside stop lamp not working (1.2.1b) Offside stop lamp not working (1.2.1b) 08 March 2013 [16:40] 08/03/2013 117087163420 117087163420
1 Offside rear direction indicator not working (1.4.a.2c) Offside rear direction indicator not working (1.4.a.2c) 08 March 2013 [16:40] 08/03/2013 117087163420 117087163420
1 Offside rear direction indicator missing (1.4.a.2b) Offside rear direction indicator missing (1.4.a.2b) 08 March 2013 [16:40] 08/03/2013 117087163420 117087163420
1 Offside windscreen washer provides insufficient washer liquid (8.2.3) Offside windscreen washer provides insufficient washer liquid (8.2.3) 08 March 2013 [16:40] 08/03/2013 117087163420 117087163420
1 Rear exhaust system not adequately supported (7.1.1) Rear exhaust system not adequately supported (7.1.1) 08 March 2013 [16:40] 08/03/2013 117087163420 117087163420
1 Offside rear suspension spring mounting prescribed area is excessively corroded (2.4.a.3) Offside rear suspension spring mounting prescribed area is excessively corroded (2.4.a.3) 08 March 2013 [16:40] 08/03/2013 117087163420 117087163420
1 Nearside rear suspension spring mounting prescribed area is excessively corroded (2.4.a.3) Nearside rear suspension spring mounting prescribed area is excessively corroded (2.4.a.3) 08 March 2013 [16:40] 08/03/2013 117087163420 117087163420

MOT TEST: 08 March 2013 16:40:32 FAILED
MOT TEST: 08 March 2013 16:40:32 FAILED

This test (117087163420) was completed on the 08 March 2013 16:40:32 and FAILED the requirements for a valid MOT with 11 comments.

This test (117087163420) was completed on the 08 March 2013 16:40:32 and FAILED the requirements for a valid MOT with 11 comments.

Recorded mileage: 62,836

Recorded mileage: 62,836


FAIL