743 GEA


743GEA is registered to a Black 1962, Morris Minor 1000 with a Petrol engine. It Failed its most recent MOT Test on the 18 August 2017

40 unique faults (46 Total) reported in its MOT History (17 Tests).

6 common/recurring faults, the most frequent (2 times) is: both rear tyres have deep age related cracks in tread.

47% (8) MOT Pass Rate and a 53% (9) MOT Failure Rate.

62,748 recorded miles.

743 GEA


743GEA is registered to a Black 1962, Morris Minor 1000 with a Petrol engine. It Failed its most recent MOT Test on the 18 August 2017

40 unique faults (46 Total) reported in its MOT History (17 Tests).

6 common/recurring faults, the most frequent (2 times) is: both rear tyres have deep age related cracks in tread.

47% (8) MOT Pass Rate and a 53% (9) MOT Failure Rate.

62,748 recorded miles.

MOT PASS/Failure rate for 743 GEA

all MOT test results for 743 GEA represented as a percentage
MOT PASS/Failure rate for 743 GEA
all MOT test results for 743 GEA represented as a percentage

PERCENTAGE OF VEHICLE FAULTS WITH 743 GEA

ALL REPORTED FAULTS, DISPLAYED BY PERCENTAGE OF OCCURRENCE DURING ALL MOT TESTS
PERCENTAGE OF VEHICLE FAULTS WITH 743 GEA
ALL REPORTED FAULTS, DISPLAYED BY PERCENTAGE OF OCCURRENCE DURING ALL MOT TESTS
ADVISORY

FAIL

USER ENTERED

PASS WITH RECTIFICATION

743 GEA annual Faults by type

ALL REPORTED FAULTS, DISPLAYED over time and categorised by type
743 GEA annual Faults by type
ALL REPORTED FAULTS, DISPLAYED over time and categorised by type

RECURRING FAULTS WITH 743 GEA

FAULTS THAT HAVE OCCURED MORE THAN ONCE DURING 743 GEA's MOT HISTORY
RECURRING FAULTS WITH 743 GEA
FAULTS THAT HAVE OCCURED MORE THAN ONCE DURING 743 GEA's MOT HISTORY
Fault Fault Test Date Test Date/Time Reference MOT Test Reference
2 Both rear tyres have deep age related cracks in tread Both rear tyres have deep age related cracks in tread 18 August 2017 [15:41] 18/08/2017 12 August 2017 [08:10] 12/08/2017 562101958951 562101958951 675201332630 675201332630
2 Brakes imbalanced across an axle (3.7.b.5b) Brakes imbalanced across an axle (3.7.b.5b) 12 August 2017 [08:10] 12/08/2017 18 July 2012 [11:36] 18/07/2012 675201332630 675201332630 355360302498 355360302498
2 Front exhaust has a major leak of exhaust gases (7.1.2) Front exhaust has a major leak of exhaust gases (7.1.2) 11 August 2016 [13:27] 11/08/2016 08 August 2013 [11:56] 08/08/2013 653180153000 653180153000 797760623292 797760623292
2 Front wheel bearing has slight play (2.5.a.3c) Front wheel bearing has slight play (2.5.a.3c) 02 June 2011 [16:24] 02/06/2011 01 June 2011 [16:54] 01/06/2011 109883751101 109883751101 828482451192 828482451192
2 Offside front wheel bearing is slightly rough when rotated. Offside front wheel bearing is slightly rough when rotated. 02 June 2011 [16:24] 02/06/2011 01 June 2011 [16:54] 01/06/2011 109883751101 109883751101 828482451192 828482451192
2 Windscreen washer provides insufficient washer liquid (8.2.3) Windscreen washer provides insufficient washer liquid (8.2.3) 01 June 2011 [16:54] 01/06/2011 20 July 2010 [12:54] 20/07/2010 828482451192 828482451192 853491300276 853491300276

ALL 743 GEA ADVISORIES [7]

ALL ADVISORIES, ORDERED by OCCURRENCE DURING 743 GEA's MOT HISTORY
ALL 743 GEA ADVISORIES [7]
ALL ADVISORIES, ORDERED by OCCURRENCE DURING 743 GEA's MOT HISTORY
Advisory Faults | source www.vehiclestats.co.uk
Fault Fault Test Date Test Date/Time Reference MOT Test Reference
2 Both rear tyres have deep age related cracks in tread Both rear tyres have deep age related cracks in tread 18 August 2017 [15:41] 18/08/2017 12 August 2017 [08:10] 12/08/2017 562101958951 562101958951 675201332630 675201332630
2 Front wheel bearing has slight play (2.5.a.3c) Front wheel bearing has slight play (2.5.a.3c) 02 June 2011 [16:24] 02/06/2011 01 June 2011 [16:54] 01/06/2011 109883751101 109883751101 828482451192 828482451192
1 Nearside front front wheel bearing has slight play (2.5.a.3c) Nearside front front wheel bearing has slight play (2.5.a.3c) 15 July 2013 [15:17] 15/07/2013 568706293181 568706293181
1 Offside front front wheel bearing has slight play (2.5.a.3c) Offside front front wheel bearing has slight play (2.5.a.3c) 15 July 2013 [15:17] 15/07/2013 568706293181 568706293181
1 Offside front brake hose slightly deteriorated (3.6.b.4d) Offside front brake hose slightly deteriorated (3.6.b.4d) 15 July 2013 [15:17] 15/07/2013 568706293181 568706293181

ALL 743 GEA Failure Faults [22]

ALL Failure faults, ORDERED by OCCURRENCE DURING 743 GEA's MOT HISTORY
ALL 743 GEA Failure Faults [22]
ALL Failure faults, ORDERED by OCCURRENCE DURING 743 GEA's MOT HISTORY
Fail Faults | source www.vehiclestats.co.uk
Fault Fault Test Date Test Date/Time Reference MOT Test Reference
2 Brakes imbalanced across an axle (3.7.b.5b) Brakes imbalanced across an axle (3.7.b.5b) 12 August 2017 [08:10] 12/08/2017 18 July 2012 [11:36] 18/07/2012 675201332630 675201332630 355360302498 355360302498
2 Windscreen washer provides insufficient washer liquid (8.2.3) Windscreen washer provides insufficient washer liquid (8.2.3) 01 June 2011 [16:54] 01/06/2011 20 July 2010 [12:54] 20/07/2010 828482451192 828482451192 853491300276 853491300276
1 Offside front track rod end ball joint dust cover insecure so that it no longer prevents the ingress of dirt (2.2.c.1c) Offside front track rod end ball joint dust cover insecure so that it no longer prevents the ingress of dirt (2.2.c.1c) 12 August 2017 [08:10] 12/08/2017 675201332630 675201332630
1 Offside front track rod end ball joint has excessive play (2.2.b.1f) Offside front track rod end ball joint has excessive play (2.2.b.1f) 12 August 2017 [08:10] 12/08/2017 675201332630 675201332630
1 Nearside front headlamp not working on main beam (1.7.5a) Nearside front headlamp not working on main beam (1.7.5a) 12 August 2017 [08:10] 12/08/2017 675201332630 675201332630
1 Nearside rear rear brake recording little or no effort (3.7.b.5a) Nearside rear rear brake recording little or no effort (3.7.b.5a) 12 August 2017 [08:10] 12/08/2017 675201332630 675201332630
1 Nearside rear rear parking brake recording little or no effort (3.7.b.6a) Nearside rear rear parking brake recording little or no effort (3.7.b.6a) 12 August 2017 [08:10] 12/08/2017 675201332630 675201332630
1 Parking brake: efficiency below requirements (3.7.b.7) Parking brake: efficiency below requirements (3.7.b.7) 12 August 2017 [08:10] 12/08/2017 675201332630 675201332630
1 Rear brakes imbalanced across an axle axle 2 (3.7.b.5b) Rear brakes imbalanced across an axle axle 2 (3.7.b.5b) 12 August 2017 [08:10] 12/08/2017 675201332630 675201332630
1 Direction indicators not working (1.4.a.2c) Direction indicators not working (1.4.a.2c) 11 August 2016 [13:27] 11/08/2016 653180153000 653180153000
1 Nearside headlamp aim too high (1.8) Nearside headlamp aim too high (1.8) 11 August 2016 [13:27] 11/08/2016 653180153000 653180153000
1 Offside headlamp aim too high (1.8) Offside headlamp aim too high (1.8) 11 August 2016 [13:27] 11/08/2016 653180153000 653180153000
1 Exhaust system not adequately supported (7.1.1) Exhaust system not adequately supported (7.1.1) 11 August 2016 [13:27] 11/08/2016 653180153000 653180153000
1 Front exhaust has a major leak of exhaust gases (7.1.2) Front exhaust has a major leak of exhaust gases (7.1.2) 11 August 2016 [13:27] 11/08/2016 653180153000 653180153000
1 Rear axle beam cracked (2.5.a.5a) Rear axle beam cracked (2.5.a.5a) 15 July 2013 [15:17] 15/07/2013 568706293181 568706293181
1 Front windscreen wiper not operating automatically when switched on (8.2.1b) Front windscreen wiper not operating automatically when switched on (8.2.1b) 01 June 2011 [16:54] 01/06/2011 828482451192 828482451192
1 Windscreen wiper does not clear the windscreen effectively (8.2.2) Windscreen wiper does not clear the windscreen effectively (8.2.2) 20 July 2010 [12:54] 20/07/2010 853491300276 853491300276
1 Nearside front hydraulic brake cylinder leaking hydraulic fluid (3.6.a.1) Nearside front hydraulic brake cylinder leaking hydraulic fluid (3.6.a.1) 20 July 2010 [12:54] 20/07/2010 853491300276 853491300276
1 Nearside front upper front suspension has excessive play in a upper suspension ball joint (2.5.b.1a) Nearside front upper front suspension has excessive play in a upper suspension ball joint (2.5.b.1a) 20 July 2010 [12:54] 20/07/2010 853491300276 853491300276
1 Offside rear suspension spring mounting prescribed area is excessively corroded (2.4.a.3) Offside rear suspension spring mounting prescribed area is excessively corroded (2.4.a.3) 20 July 2010 [12:54] 20/07/2010 853491300276 853491300276

ALL 743 GEA User Entered Faults [2]

ALL User Entered faults, ORDERED by OCCURRENCE DURING 743 GEA's MOT HISTORY
ALL 743 GEA User Entered Faults [2]
ALL User Entered faults, ORDERED by OCCURRENCE DURING 743 GEA's MOT HISTORY
Advisory Faults | source www.vehiclestats.co.uk
Fault Fault Test Date Test Date/Time Reference MOT Test Reference
2 Offside front wheel bearing is slightly rough when rotated. Offside front wheel bearing is slightly rough when rotated. 02 June 2011 [16:24] 02/06/2011 01 June 2011 [16:54] 01/06/2011 109883751101 109883751101 828482451192 828482451192

ALL 743 GEA Pass With Rectification Faults [15]

ALL Pass With Rectification faults, ORDERED by OCCURRENCE DURING 743 GEA's MOT HISTORY
ALL 743 GEA Pass With Rectification Faults [15]
ALL Pass With Rectification faults, ORDERED by OCCURRENCE DURING 743 GEA's MOT HISTORY
Pass With Rectification Faults | source www.vehiclestats.co.uk
Fault Fault Test Date Test Date/Time Reference MOT Test Reference
1 Front brake application uneven (3.7.b.2) Front brake application uneven (3.7.b.2) 06 August 2015 [12:27] 06/08/2015 246581341495 246581341495
1 Offside front brake binding (3.7.b.1) Offside front brake binding (3.7.b.1) 06 August 2015 [12:27] 06/08/2015 246581341495 246581341495
1 Front brakes release unevenly (3.7.b.4) Front brakes release unevenly (3.7.b.4) 06 August 2015 [12:27] 06/08/2015 246581341495 246581341495
1 Nearside tie bar/rod attachment bracket/mounting insecure (2.4.g.1) Nearside tie bar/rod attachment bracket/mounting insecure (2.4.g.1) 06 August 2015 [12:27] 06/08/2015 246581341495 246581341495
1 Nearside front wheel bearing has excessive play (2.5.a.3c) Nearside front wheel bearing has excessive play (2.5.a.3c) 05 August 2014 [11:19] 05/08/2014 108847914204 108847914204
1 Offside front wheel bearing has excessive play (2.5.a.3c) Offside front wheel bearing has excessive play (2.5.a.3c) 05 August 2014 [11:19] 05/08/2014 108847914204 108847914204
1 Nearside headlamp not working on dipped beam (1.7.5a) Nearside headlamp not working on dipped beam (1.7.5a) 05 August 2014 [11:19] 05/08/2014 108847914204 108847914204
1 Nearside leaf spring splayed and action impaired (2.4.b.1c) Nearside leaf spring splayed and action impaired (2.4.b.1c) 05 August 2014 [11:19] 05/08/2014 108847914204 108847914204
1 Offside leaf spring splayed and action impaired (2.4.b.1c) Offside leaf spring splayed and action impaired (2.4.b.1c) 05 August 2014 [11:19] 05/08/2014 108847914204 108847914204
1 Nearside stop lamp not working (1.2.1b) Nearside stop lamp not working (1.2.1b) 08 August 2013 [11:56] 08/08/2013 797760623292 797760623292
1 Offside stop lamp not working (1.2.1b) Offside stop lamp not working (1.2.1b) 08 August 2013 [11:56] 08/08/2013 797760623292 797760623292
1 Offside rear rear brake recording little or no effort (3.7.b.5a) Offside rear rear brake recording little or no effort (3.7.b.5a) 08 August 2013 [11:56] 08/08/2013 797760623292 797760623292
1 Offside rear parking (secondary) brake grabbing severely (3.7.b.6b) Offside rear parking (secondary) brake grabbing severely (3.7.b.6b) 08 August 2013 [11:56] 08/08/2013 797760623292 797760623292
1 Front exhaust has a major leak of exhaust gases (7.1.2) Front exhaust has a major leak of exhaust gases (7.1.2) 08 August 2013 [11:56] 08/08/2013 797760623292 797760623292
1 Battery insecure (1.9.1) Battery insecure (1.9.1) 15 July 2013 [15:17] 15/07/2013 568706293181 568706293181

MOT TEST: 18 August 2017 15:41:20 PASSED
MOT TEST: 18 August 2017 15:41:20 PASSED

This test (562101958951) was completed on the 18 August 2017 15:41:20 and PASSED the requirements for a valid MOT with 1 comments.

This test (562101958951) was completed on the 18 August 2017 15:41:20 and PASSED the requirements for a valid MOT with 1 comments.

Recorded mileage: 62,748

Recorded mileage: 62,748


ADVISORY


MOT TEST: 12 August 2017 08:10:20 FAILED
MOT TEST: 12 August 2017 08:10:20 FAILED

This test (675201332630) was completed on the 12 August 2017 08:10:20 and FAILED the requirements for a valid MOT with 9 comments.

This test (675201332630) was completed on the 12 August 2017 08:10:20 and FAILED the requirements for a valid MOT with 9 comments.

Recorded mileage: 62,739

Recorded mileage: 62,739


ADVISORY

FAIL


MOT TEST: 16 August 2016 16:10:01 PASSED
MOT TEST: 16 August 2016 16:10:01 PASSED

This test (497522738720) was completed on the 16 August 2016 16:10:01 and PASSED the requirements for a valid MOT with 0 comments.

This test (497522738720) was completed on the 16 August 2016 16:10:01 and PASSED the requirements for a valid MOT with 0 comments.

Recorded mileage: 60,712

Recorded mileage: 60,712


MOT TEST: 11 August 2016 13:27:09 FAILED
MOT TEST: 11 August 2016 13:27:09 FAILED

This test (653180153000) was completed on the 11 August 2016 13:27:09 and FAILED the requirements for a valid MOT with 5 comments.

This test (653180153000) was completed on the 11 August 2016 13:27:09 and FAILED the requirements for a valid MOT with 5 comments.

Recorded mileage: 60,712

Recorded mileage: 60,712


FAIL


MOT TEST: 06 August 2015 12:27:17 PASSED
MOT TEST: 06 August 2015 12:27:17 PASSED

This test (242663122945) was completed on the 06 August 2015 12:27:17 and PASSED the requirements for a valid MOT with 0 comments.

This test (242663122945) was completed on the 06 August 2015 12:27:17 and PASSED the requirements for a valid MOT with 0 comments.

Recorded mileage: 58,149

Recorded mileage: 58,149


MOT TEST: 06 August 2015 12:27:16 FAILED
MOT TEST: 06 August 2015 12:27:16 FAILED

This test (246581341495) was completed on the 06 August 2015 12:27:16 and FAILED the requirements for a valid MOT with 4 comments.

This test (246581341495) was completed on the 06 August 2015 12:27:16 and FAILED the requirements for a valid MOT with 4 comments.

Recorded mileage: 58,149

Recorded mileage: 58,149


PASS WITH RECTIFICATION


MOT TEST: 05 August 2014 11:19:17 PASSED
MOT TEST: 05 August 2014 11:19:17 PASSED

This test (149827814220) was completed on the 05 August 2014 11:19:17 and PASSED the requirements for a valid MOT with 0 comments.

This test (149827814220) was completed on the 05 August 2014 11:19:17 and PASSED the requirements for a valid MOT with 0 comments.

Recorded mileage: 55,812

Recorded mileage: 55,812


MOT TEST: 05 August 2014 11:19:17 FAILED
MOT TEST: 05 August 2014 11:19:17 FAILED

This test (108847914204) was completed on the 05 August 2014 11:19:17 and FAILED the requirements for a valid MOT with 5 comments.

This test (108847914204) was completed on the 05 August 2014 11:19:17 and FAILED the requirements for a valid MOT with 5 comments.

Recorded mileage: 55,812

Recorded mileage: 55,812


PASS WITH RECTIFICATION


MOT TEST: 08 August 2013 11:56:04 PASSED
MOT TEST: 08 August 2013 11:56:04 PASSED

This test (198500423266) was completed on the 08 August 2013 11:56:04 and PASSED the requirements for a valid MOT with 0 comments.

This test (198500423266) was completed on the 08 August 2013 11:56:04 and PASSED the requirements for a valid MOT with 0 comments.

Recorded mileage: 53,029

Recorded mileage: 53,029


MOT TEST: 08 August 2013 11:56:04 FAILED
MOT TEST: 08 August 2013 11:56:04 FAILED

This test (797760623292) was completed on the 08 August 2013 11:56:04 and FAILED the requirements for a valid MOT with 5 comments.

This test (797760623292) was completed on the 08 August 2013 11:56:04 and FAILED the requirements for a valid MOT with 5 comments.

Recorded mileage: 53,029

Recorded mileage: 53,029


PASS WITH RECTIFICATION


MOT TEST: 15 July 2013 15:17:11 FAILED
MOT TEST: 15 July 2013 15:17:11 FAILED

This test (568706293181) was completed on the 15 July 2013 15:17:11 and FAILED the requirements for a valid MOT with 5 comments.

This test (568706293181) was completed on the 15 July 2013 15:17:11 and FAILED the requirements for a valid MOT with 5 comments.

Recorded mileage: 52,988

Recorded mileage: 52,988


ADVISORY

FAIL

PASS WITH RECTIFICATION


MOT TEST: 27 July 2012 11:48:30 PASSED
MOT TEST: 27 July 2012 11:48:30 PASSED

This test (257509702263) was completed on the 27 July 2012 11:48:30 and PASSED the requirements for a valid MOT with 0 comments.

This test (257509702263) was completed on the 27 July 2012 11:48:30 and PASSED the requirements for a valid MOT with 0 comments.

Recorded mileage: 50,704

Recorded mileage: 50,704


MOT TEST: 18 July 2012 11:36:08 FAILED
MOT TEST: 18 July 2012 11:36:08 FAILED

This test (355360302498) was completed on the 18 July 2012 11:36:08 and FAILED the requirements for a valid MOT with 1 comments.

This test (355360302498) was completed on the 18 July 2012 11:36:08 and FAILED the requirements for a valid MOT with 1 comments.

Recorded mileage: 50,704

Recorded mileage: 50,704


FAIL


MOT TEST: 02 June 2011 16:24:47 PASSED
MOT TEST: 02 June 2011 16:24:47 PASSED

This test (109883751101) was completed on the 02 June 2011 16:24:47 and PASSED the requirements for a valid MOT with 2 comments.

This test (109883751101) was completed on the 02 June 2011 16:24:47 and PASSED the requirements for a valid MOT with 2 comments.

Recorded mileage: 59,196

Recorded mileage: 59,196


ADVISORY

USER ENTERED


MOT TEST: 01 June 2011 16:54:33 FAILED
MOT TEST: 01 June 2011 16:54:33 FAILED

This test (828482451192) was completed on the 01 June 2011 16:54:33 and FAILED the requirements for a valid MOT with 4 comments.

This test (828482451192) was completed on the 01 June 2011 16:54:33 and FAILED the requirements for a valid MOT with 4 comments.

Recorded mileage: 59,196

Recorded mileage: 59,196


ADVISORY

FAIL

USER ENTERED


MOT TEST: 26 July 2010 14:19:22 PASSED
MOT TEST: 26 July 2010 14:19:22 PASSED

This test (341897100409) was completed on the 26 July 2010 14:19:22 and PASSED the requirements for a valid MOT with 0 comments.

This test (341897100409) was completed on the 26 July 2010 14:19:22 and PASSED the requirements for a valid MOT with 0 comments.

Recorded mileage: 59,085

Recorded mileage: 59,085


MOT TEST: 20 July 2010 12:54:22 FAILED
MOT TEST: 20 July 2010 12:54:22 FAILED

This test (853491300276) was completed on the 20 July 2010 12:54:22 and FAILED the requirements for a valid MOT with 5 comments.

This test (853491300276) was completed on the 20 July 2010 12:54:22 and FAILED the requirements for a valid MOT with 5 comments.

Recorded mileage: 59,084

Recorded mileage: 59,084


FAIL