745 YUG


745YUG is registered to a Red 1994, Morgan 4/4 with a Petrol engine. It Failed its most recent MOT Test on the 11 May 2015

5 unique faults (6 Total) reported in its MOT History (5 Tests).

1 common/recurring faults.

80% (4) MOT Pass Rate and a 20% (1) MOT Failure Rate.

13,692 recorded miles.

745 YUG


745YUG is registered to a Red 1994, Morgan 4/4 with a Petrol engine. It Failed its most recent MOT Test on the 11 May 2015

5 unique faults (6 Total) reported in its MOT History (5 Tests).

1 common/recurring faults.

80% (4) MOT Pass Rate and a 20% (1) MOT Failure Rate.

13,692 recorded miles.

MOT PASS/Failure rate for 745 YUG

all MOT test results for 745 YUG represented as a percentage
MOT PASS/Failure rate for 745 YUG
all MOT test results for 745 YUG represented as a percentage

PERCENTAGE OF VEHICLE FAULTS WITH 745 YUG

ALL REPORTED FAULTS, DISPLAYED BY PERCENTAGE OF OCCURRENCE DURING ALL MOT TESTS
PERCENTAGE OF VEHICLE FAULTS WITH 745 YUG
ALL REPORTED FAULTS, DISPLAYED BY PERCENTAGE OF OCCURRENCE DURING ALL MOT TESTS
FAIL

USER ENTERED

745 YUG annual Faults by type

ALL REPORTED FAULTS, DISPLAYED over time and categorised by type
745 YUG annual Faults by type
ALL REPORTED FAULTS, DISPLAYED over time and categorised by type

ALL 745 YUG Failure Faults [4]

ALL Failure faults, ORDERED by OCCURRENCE DURING 745 YUG's MOT HISTORY
ALL 745 YUG Failure Faults [4]
ALL Failure faults, ORDERED by OCCURRENCE DURING 745 YUG's MOT HISTORY
Fail Faults | source www.vehiclestats.co.uk
Fault Fault Test Date Test Date/Time Reference MOT Test Reference
1 Nearside headlamp not working on dipped beam (1.7.5a) Nearside headlamp not working on dipped beam (1.7.5a) 11 May 2015 [16:19] 11/05/2015 496271935127 496271935127
1 Nearside headlamp not working on main beam (1.7.5a) Nearside headlamp not working on main beam (1.7.5a) 11 May 2015 [16:19] 11/05/2015 496271935127 496271935127
1 Offside headlamp not working on dipped beam (1.7.5a) Offside headlamp not working on dipped beam (1.7.5a) 11 May 2015 [16:19] 11/05/2015 496271935127 496271935127
1 Offside headlamp not working on main beam (1.7.5a) Offside headlamp not working on main beam (1.7.5a) 11 May 2015 [16:19] 11/05/2015 496271935127 496271935127

ALL 745 YUG User Entered Faults [2]

ALL User Entered faults, ORDERED by OCCURRENCE DURING 745 YUG's MOT HISTORY
ALL 745 YUG User Entered Faults [2]
ALL User Entered faults, ORDERED by OCCURRENCE DURING 745 YUG's MOT HISTORY
User Entered Faults | source www.vehiclestats.co.uk
Fault Fault Test Date Test Date/Time Reference MOT Test Reference
2 Fuel pipe perished and another kinked Fuel pipe perished and another kinked 11 May 2015 [16:51] 11/05/2015 11 May 2015 [16:19] 11/05/2015 226451635433 226451635433 496271935127 496271935127

MOT TEST: 11 May 2015 16:51:14 PASSED
MOT TEST: 11 May 2015 16:51:14 PASSED

This test (226451635433) was completed on the 11 May 2015 16:51:14 and PASSED the requirements for a valid MOT with 1 comments.

This test (226451635433) was completed on the 11 May 2015 16:51:14 and PASSED the requirements for a valid MOT with 1 comments.

Recorded mileage: 13,692

Recorded mileage: 13,692


USER ENTERED


MOT TEST: 11 May 2015 16:19:37 FAILED
MOT TEST: 11 May 2015 16:19:37 FAILED

This test (496271935127) was completed on the 11 May 2015 16:19:37 and FAILED the requirements for a valid MOT with 5 comments.

This test (496271935127) was completed on the 11 May 2015 16:19:37 and FAILED the requirements for a valid MOT with 5 comments.

Recorded mileage: 13,692

Recorded mileage: 13,692


FAIL

USER ENTERED


MOT TEST: 12 May 2014 16:36:11 PASSED
MOT TEST: 12 May 2014 16:36:11 PASSED

This test (117062734135) was completed on the 12 May 2014 16:36:11 and PASSED the requirements for a valid MOT with 0 comments.

This test (117062734135) was completed on the 12 May 2014 16:36:11 and PASSED the requirements for a valid MOT with 0 comments.

Recorded mileage: 11,165

Recorded mileage: 11,165


MOT TEST: 01 May 2008 10:57:27 PASSED
MOT TEST: 01 May 2008 10:57:27 PASSED

This test (194992928159) was completed on the 01 May 2008 10:57:27 and PASSED the requirements for a valid MOT with 0 comments.

This test (194992928159) was completed on the 01 May 2008 10:57:27 and PASSED the requirements for a valid MOT with 0 comments.

Recorded mileage: 10,271

Recorded mileage: 10,271


MOT TEST: 25 April 2006 17:31:57 PASSED
MOT TEST: 25 April 2006 17:31:57 PASSED

This test (973955116174) was completed on the 25 April 2006 17:31:57 and PASSED the requirements for a valid MOT with 0 comments.

This test (973955116174) was completed on the 25 April 2006 17:31:57 and PASSED the requirements for a valid MOT with 0 comments.

Recorded mileage: 9,969

Recorded mileage: 9,969