747 BPA


747BPA is registered to a Grey 1956, Morris Minor with a Petrol engine. It Failed its most recent MOT Test on the 11 October 2010

22 unique faults (23 Total) reported in its MOT History (8 Tests).

1 common/recurring faults.

50% (4) MOT Pass Rate and a 50% (4) MOT Failure Rate.

92,753 recorded miles.

747 BPA


747BPA is registered to a Grey 1956, Morris Minor with a Petrol engine. It Failed its most recent MOT Test on the 11 October 2010

22 unique faults (23 Total) reported in its MOT History (8 Tests).

1 common/recurring faults.

50% (4) MOT Pass Rate and a 50% (4) MOT Failure Rate.

92,753 recorded miles.

MOT PASS/Failure rate for 747 BPA

all MOT test results for 747 BPA represented as a percentage
MOT PASS/Failure rate for 747 BPA
all MOT test results for 747 BPA represented as a percentage

PERCENTAGE OF VEHICLE FAULTS WITH 747 BPA

ALL REPORTED FAULTS, DISPLAYED BY PERCENTAGE OF OCCURRENCE DURING ALL MOT TESTS
PERCENTAGE OF VEHICLE FAULTS WITH 747 BPA
ALL REPORTED FAULTS, DISPLAYED BY PERCENTAGE OF OCCURRENCE DURING ALL MOT TESTS
FAIL

USER ENTERED

747 BPA annual Faults by type

ALL REPORTED FAULTS, DISPLAYED over time and categorised by type
747 BPA annual Faults by type
ALL REPORTED FAULTS, DISPLAYED over time and categorised by type

ALL 747 BPA Failure Faults [20]

ALL Failure faults, ORDERED by OCCURRENCE DURING 747 BPA's MOT HISTORY
ALL 747 BPA Failure Faults [20]
ALL Failure faults, ORDERED by OCCURRENCE DURING 747 BPA's MOT HISTORY
Fail Faults | source www.vehiclestats.co.uk
Fault Fault Test Date Test Date/Time Reference MOT Test Reference
2 Brakes imbalanced across an axle (3.7.b.5b) Brakes imbalanced across an axle (3.7.b.5b) 02 October 2008 [13:21] 02/10/2008 22 August 2007 [09:56] 22/08/2007 301736178468 301736178468 863744737227 863744737227
1 Nearside direction indicators not working (1.4.a.2c) Nearside direction indicators not working (1.4.a.2c) 07 October 2010 [11:48] 07/10/2010 523960480227 523960480227
1 Offside direction indicators not working (1.4.a.2c) Offside direction indicators not working (1.4.a.2c) 07 October 2010 [11:48] 07/10/2010 523960480227 523960480227
1 Nearside windscreen washer provides insufficient washer liquid (8.2.3) Nearside windscreen washer provides insufficient washer liquid (8.2.3) 07 October 2010 [11:48] 07/10/2010 523960480227 523960480227
1 Offside windscreen washer provides insufficient washer liquid (8.2.3) Offside windscreen washer provides insufficient washer liquid (8.2.3) 07 October 2010 [11:48] 07/10/2010 523960480227 523960480227
1 Offside windscreen wiper does not clear the windscreen effectively (8.2.2) Offside windscreen wiper does not clear the windscreen effectively (8.2.2) 25 September 2009 [16:51] 25/09/2009 942618169282 942618169282
1 Offside headlamp excessively damaged so that the light output is severely reduced (1.7.5a) Offside headlamp excessively damaged so that the light output is severely reduced (1.7.5a) 25 September 2009 [16:51] 25/09/2009 942618169282 942618169282
1 Fuel cap/sealing device does not fasten securely by positive means (7.2.4b) Fuel cap/sealing device does not fasten securely by positive means (7.2.4b) 25 September 2009 [16:51] 25/09/2009 942618169282 942618169282
1 Offside rear position lamp(s) excessively deteriorated so that it is not visible from a reasonable distance (1.1.a.3d) Offside rear position lamp(s) excessively deteriorated so that it is not visible from a reasonable distance (1.1.a.3d) 25 September 2009 [16:51] 25/09/2009 942618169282 942618169282
1 Nearside headlamp not in good working order adversely affecting beam image (1.2.4a) Nearside headlamp not in good working order adversely affecting beam image (1.2.4a) 22 August 2007 [09:56] 22/08/2007 863744737227 863744737227
1 Nearside headlamp not working on main beam (1.7.5a) Nearside headlamp not working on main beam (1.7.5a) 22 August 2007 [09:56] 22/08/2007 863744737227 863744737227
1 Offside headlamp not working on main beam (1.7.5a) Offside headlamp not working on main beam (1.7.5a) 22 August 2007 [09:56] 22/08/2007 863744737227 863744737227
1 Nearside semaphore indicator arm does not extend smoothly (1.4.c.1a) Nearside semaphore indicator arm does not extend smoothly (1.4.c.1a) 22 August 2007 [09:56] 22/08/2007 863744737227 863744737227
1 Offside semaphore indicator arm does not extend smoothly (1.4.c.1a) Offside semaphore indicator arm does not extend smoothly (1.4.c.1a) 22 August 2007 [09:56] 22/08/2007 863744737227 863744737227
1 Offside rear suspension spring mounting prescribed area is excessively corroded (2.4.a.3) Offside rear suspension spring mounting prescribed area is excessively corroded (2.4.a.3) 22 August 2007 [09:56] 22/08/2007 863744737227 863744737227
1 Nearside front suspension component mounting prescribed area is excessively corroded (2.4.a.3) Nearside front suspension component mounting prescribed area is excessively corroded (2.4.a.3) 22 August 2007 [09:56] 22/08/2007 863744737227 863744737227
1 Offside rear brake binding (3.7.b.1) Offside rear brake binding (3.7.b.1) 22 August 2007 [09:56] 22/08/2007 863744737227 863744737227
1 Rear brake application uneven (3.7.b.2) Rear brake application uneven (3.7.b.2) 22 August 2007 [09:56] 22/08/2007 863744737227 863744737227
1 Front brake application uneven (3.7.b.2) Front brake application uneven (3.7.b.2) 22 August 2007 [09:56] 22/08/2007 863744737227 863744737227

ALL 747 BPA User Entered Faults [3]

ALL User Entered faults, ORDERED by OCCURRENCE DURING 747 BPA's MOT HISTORY
ALL 747 BPA User Entered Faults [3]
ALL User Entered faults, ORDERED by OCCURRENCE DURING 747 BPA's MOT HISTORY
Fail Faults | source www.vehiclestats.co.uk
Fault Fault Test Date Test Date/Time Reference MOT Test Reference
1 Front metal brake pipes rusty Front metal brake pipes rusty 07 October 2010 [11:48] 07/10/2010 523960480227 523960480227
1 Small corroison to n/s/f inner arch Small corroison to n/s/f inner arch 07 October 2010 [11:48] 07/10/2010 523960480227 523960480227
1 Fuel lines rusty Fuel lines rusty 07 October 2010 [11:48] 07/10/2010 523960480227 523960480227

MOT TEST: 11 October 2010 14:45:44 PASSED
MOT TEST: 11 October 2010 14:45:44 PASSED

This test (332714980283) was completed on the 11 October 2010 14:45:44 and PASSED the requirements for a valid MOT with 0 comments.

This test (332714980283) was completed on the 11 October 2010 14:45:44 and PASSED the requirements for a valid MOT with 0 comments.

Recorded mileage: 92,753

Recorded mileage: 92,753


MOT TEST: 07 October 2010 11:48:40 FAILED
MOT TEST: 07 October 2010 11:48:40 FAILED

This test (523960480227) was completed on the 07 October 2010 11:48:40 and FAILED the requirements for a valid MOT with 7 comments.

This test (523960480227) was completed on the 07 October 2010 11:48:40 and FAILED the requirements for a valid MOT with 7 comments.

Recorded mileage: 92,753

Recorded mileage: 92,753


FAIL

USER ENTERED


MOT TEST: 26 September 2009 12:08:32 PASSED
MOT TEST: 26 September 2009 12:08:32 PASSED

This test (891219869294) was completed on the 26 September 2009 12:08:32 and PASSED the requirements for a valid MOT with 0 comments.

This test (891219869294) was completed on the 26 September 2009 12:08:32 and PASSED the requirements for a valid MOT with 0 comments.

Recorded mileage: 92,704

Recorded mileage: 92,704


MOT TEST: 25 September 2009 16:51:17 FAILED
MOT TEST: 25 September 2009 16:51:17 FAILED

This test (942618169282) was completed on the 25 September 2009 16:51:17 and FAILED the requirements for a valid MOT with 4 comments.

This test (942618169282) was completed on the 25 September 2009 16:51:17 and FAILED the requirements for a valid MOT with 4 comments.

Recorded mileage: 92,704

Recorded mileage: 92,704


FAIL


MOT TEST: 03 October 2008 14:02:09 PASSED
MOT TEST: 03 October 2008 14:02:09 PASSED

This test (304527478217) was completed on the 03 October 2008 14:02:09 and PASSED the requirements for a valid MOT with 0 comments.

This test (304527478217) was completed on the 03 October 2008 14:02:09 and PASSED the requirements for a valid MOT with 0 comments.

Recorded mileage: 90,658

Recorded mileage: 90,658


MOT TEST: 02 October 2008 13:21:40 FAILED
MOT TEST: 02 October 2008 13:21:40 FAILED

This test (301736178468) was completed on the 02 October 2008 13:21:40 and FAILED the requirements for a valid MOT with 1 comments.

This test (301736178468) was completed on the 02 October 2008 13:21:40 and FAILED the requirements for a valid MOT with 1 comments.

Recorded mileage: 90,658

Recorded mileage: 90,658


FAIL


MOT TEST: 31 August 2007 13:00:30 PASSED
MOT TEST: 31 August 2007 13:00:30 PASSED

This test (310643747478) was completed on the 31 August 2007 13:00:30 and PASSED the requirements for a valid MOT with 0 comments.

This test (310643747478) was completed on the 31 August 2007 13:00:30 and PASSED the requirements for a valid MOT with 0 comments.

Recorded mileage: 90,434

Recorded mileage: 90,434


MOT TEST: 22 August 2007 09:56:30 FAILED
MOT TEST: 22 August 2007 09:56:30 FAILED

This test (863744737227) was completed on the 22 August 2007 09:56:30 and FAILED the requirements for a valid MOT with 11 comments.

This test (863744737227) was completed on the 22 August 2007 09:56:30 and FAILED the requirements for a valid MOT with 11 comments.

Recorded mileage: 90,434

Recorded mileage: 90,434


FAIL