752 BPO


752BPO is registered to a Purple 1961, Morris Minor 1000 with a Petrol engine. It Passed its most recent MOT Test on the 30 August 2018

21 unique faults (22 Total) reported in its MOT History (20 Tests).

1 common/recurring faults.

65% (13) MOT Pass Rate and a 35% (7) MOT Failure Rate.

8,447 recorded miles.

752 BPO


752BPO is registered to a Purple 1961, Morris Minor 1000 with a Petrol engine. It Passed its most recent MOT Test on the 30 August 2018

21 unique faults (22 Total) reported in its MOT History (20 Tests).

1 common/recurring faults.

65% (13) MOT Pass Rate and a 35% (7) MOT Failure Rate.

8,447 recorded miles.

MOT PASS/Failure rate for 752 BPO

all MOT test results for 752 BPO represented as a percentage
MOT PASS/Failure rate for 752 BPO
all MOT test results for 752 BPO represented as a percentage

PERCENTAGE OF VEHICLE FAULTS WITH 752 BPO

ALL REPORTED FAULTS, DISPLAYED BY PERCENTAGE OF OCCURRENCE DURING ALL MOT TESTS
PERCENTAGE OF VEHICLE FAULTS WITH 752 BPO
ALL REPORTED FAULTS, DISPLAYED BY PERCENTAGE OF OCCURRENCE DURING ALL MOT TESTS
ADVISORY

FAIL

USER ENTERED

PASS WITH RECTIFICATION

752 BPO annual Faults by type

ALL REPORTED FAULTS, DISPLAYED over time and categorised by type
752 BPO annual Faults by type
ALL REPORTED FAULTS, DISPLAYED over time and categorised by type

ALL 752 BPO ADVISORIES [6]

ALL ADVISORIES, ORDERED by OCCURRENCE DURING 752 BPO's MOT HISTORY
ALL 752 BPO ADVISORIES [6]
ALL ADVISORIES, ORDERED by OCCURRENCE DURING 752 BPO's MOT HISTORY
Advisory Faults | source www.vehiclestats.co.uk
Fault Fault Test Date Test Date/Time Reference MOT Test Reference
2 Offside front tyre worn close to the legal limit (4.1.e.1) Offside front tyre worn close to the legal limit (4.1.e.1) 25 October 2016 [13:31] 25/10/2016 18 October 2016 [15:41] 18/10/2016 821264102138 821264102138 300669858029 300669858029
1 Nearside steering rack gaiter deteriorated (2.2.d.2d) Nearside steering rack gaiter deteriorated (2.2.d.2d) 13 November 2012 [14:41] 13/11/2012 847138912324 847138912324
1 Offside front suspension has slight play in a lower suspension ball joint (2.5.b.1a) Offside front suspension has slight play in a lower suspension ball joint (2.5.b.1a) 13 November 2012 [14:41] 13/11/2012 847138912324 847138912324
1 Offside rear service brake: service brake efficiency only just met. It would appear that the braking system requires adjustment or repair. (3.7.b.7) Offside rear service brake: service brake efficiency only just met. It would appear that the braking system requires adjustment or repair. (3.7.b.7) 04 December 2007 [15:39] 04/12/2007 233598837367 233598837367
1 Offside rear parking brake: parking brake efficiency only just met. It would appear that the braking system requires adjustment or repair. (3.7.b.7) Offside rear parking brake: parking brake efficiency only just met. It would appear that the braking system requires adjustment or repair. (3.7.b.7) 04 December 2007 [15:39] 04/12/2007 233598837367 233598837367

ALL 752 BPO Failure Faults [8]

ALL Failure faults, ORDERED by OCCURRENCE DURING 752 BPO's MOT HISTORY
ALL 752 BPO Failure Faults [8]
ALL Failure faults, ORDERED by OCCURRENCE DURING 752 BPO's MOT HISTORY
Advisory Faults | source www.vehiclestats.co.uk
Fault Fault Test Date Test Date/Time Reference MOT Test Reference
1 Offside rear tyre tread depth below requirements of 1.6mm middle tread (4.1.e.1) Offside rear tyre tread depth below requirements of 1.6mm middle tread (4.1.e.1) 18 October 2016 [15:41] 18/10/2016 300669858029 300669858029
1 Nearside rear tyre tread depth below requirements of 1.6mm middle tread (4.1.e.1) Nearside rear tyre tread depth below requirements of 1.6mm middle tread (4.1.e.1) 18 October 2016 [15:41] 18/10/2016 300669858029 300669858029
1 Offside front lower suspension arm has excessive play in a pin/bush (2.4.g.2) Offside front lower suspension arm has excessive play in a pin/bush (2.4.g.2) 18 October 2016 [15:41] 18/10/2016 300669858029 300669858029
1 Offside front front suspension has excessive play in a upper suspension ball joint (2.5.b.1a) Offside front front suspension has excessive play in a upper suspension ball joint (2.5.b.1a) 28 October 2014 [13:40] 28/10/2014 989021304309 989021304309
1 Parking brake lever has no reserve travel (3.1.6b) Parking brake lever has no reserve travel (3.1.6b) 28 October 2014 [13:40] 28/10/2014 989021304309 989021304309
1 Nearside service brake is causing the vehicle to swerve to the offside (3.7.c.2) Nearside service brake is causing the vehicle to swerve to the offside (3.7.c.2) 11 November 2011 [13:36] 11/11/2011 485385911321 485385911321
1 Offside service brake grabbing severely (3.7.c.2) Offside service brake grabbing severely (3.7.c.2) 11 November 2011 [13:36] 11/11/2011 485385911321 485385911321
1 Service brake: efficiency below requirements (3.7.b.7) Service brake: efficiency below requirements (3.7.b.7) 11 November 2011 [13:36] 11/11/2011 485385911321 485385911321

ALL 752 BPO User Entered Faults [1]

ALL User Entered faults, ORDERED by OCCURRENCE DURING 752 BPO's MOT HISTORY
ALL 752 BPO User Entered Faults [1]
ALL User Entered faults, ORDERED by OCCURRENCE DURING 752 BPO's MOT HISTORY
User Entered Faults | source www.vehiclestats.co.uk
Fault Fault Test Date Test Date/Time Reference MOT Test Reference
1 At the lower osf suspension trunion there is slight movement At the lower osf suspension trunion there is slight movement 08 November 2006 [12:07] 08/11/2006 413562916386 413562916386

ALL 752 BPO Pass With Rectification Faults [7]

ALL Pass With Rectification faults, ORDERED by OCCURRENCE DURING 752 BPO's MOT HISTORY
ALL 752 BPO Pass With Rectification Faults [7]
ALL Pass With Rectification faults, ORDERED by OCCURRENCE DURING 752 BPO's MOT HISTORY
Pass With Rectification Faults | source www.vehiclestats.co.uk
Fault Fault Test Date Test Date/Time Reference MOT Test Reference
1 Horn not working (1.6.2a) Horn not working (1.6.2a) 31 August 2017 [12:40] 31/08/2017 855561814599 855561814599
1 Offside front front suspension has excessive movement at wishbone bearing (2.5.a.1c) Offside front front suspension has excessive movement at wishbone bearing (2.5.a.1c) 31 August 2017 [12:40] 31/08/2017 855561814599 855561814599
1 Registration plate lamp not working (1.1.c.1d) Registration plate lamp not working (1.1.c.1d) 18 October 2016 [15:41] 18/10/2016 300669858029 300669858029
1 Nearside steering rack gaiter split (2.2.d.2d) Nearside steering rack gaiter split (2.2.d.2d) 06 November 2013 [12:17] 06/11/2013 377330013351 377330013351
1 Offside front brake drum contaminated by oil (3.5.1h) Offside front brake drum contaminated by oil (3.5.1h) 27 November 2009 [13:40] 27/11/2009 554481339381 554481339381
1 Nearside windscreen washer provides insufficient washer liquid (8.2.3) Nearside windscreen washer provides insufficient washer liquid (8.2.3) 19 December 2008 [09:15] 19/12/2008 560654758352 560654758352
1 Offside windscreen washer provides insufficient washer liquid (8.2.3) Offside windscreen washer provides insufficient washer liquid (8.2.3) 19 December 2008 [09:15] 19/12/2008 560654758352 560654758352

MOT TEST: 30 August 2018 14:54:22 PASSED
MOT TEST: 30 August 2018 14:54:22 PASSED

This test (147428068118) was completed on the 30 August 2018 14:54:22 and PASSED the requirements for a valid MOT with 0 comments.

This test (147428068118) was completed on the 30 August 2018 14:54:22 and PASSED the requirements for a valid MOT with 0 comments.

Recorded mileage: 8,447

Recorded mileage: 8,447


MOT TEST: 31 August 2017 12:40:09 PASSED
MOT TEST: 31 August 2017 12:40:09 PASSED

This test (954155215050) was completed on the 31 August 2017 12:40:09 and PASSED the requirements for a valid MOT with 0 comments.

This test (954155215050) was completed on the 31 August 2017 12:40:09 and PASSED the requirements for a valid MOT with 0 comments.

Recorded mileage: 7,704

Recorded mileage: 7,704


MOT TEST: 31 August 2017 12:40:08 FAILED
MOT TEST: 31 August 2017 12:40:08 FAILED

This test (855561814599) was completed on the 31 August 2017 12:40:08 and FAILED the requirements for a valid MOT with 2 comments.

This test (855561814599) was completed on the 31 August 2017 12:40:08 and FAILED the requirements for a valid MOT with 2 comments.

Recorded mileage: 7,704

Recorded mileage: 7,704


PASS WITH RECTIFICATION


MOT TEST: 25 October 2016 13:31:19 PASSED
MOT TEST: 25 October 2016 13:31:19 PASSED

This test (821264102138) was completed on the 25 October 2016 13:31:19 and PASSED the requirements for a valid MOT with 1 comments.

This test (821264102138) was completed on the 25 October 2016 13:31:19 and PASSED the requirements for a valid MOT with 1 comments.

Recorded mileage: 7,606

Recorded mileage: 7,606


ADVISORY


MOT TEST: 18 October 2016 15:41:39 FAILED
MOT TEST: 18 October 2016 15:41:39 FAILED

This test (300669858029) was completed on the 18 October 2016 15:41:39 and FAILED the requirements for a valid MOT with 5 comments.

This test (300669858029) was completed on the 18 October 2016 15:41:39 and FAILED the requirements for a valid MOT with 5 comments.

Recorded mileage: 7,606

Recorded mileage: 7,606


ADVISORY

FAIL

PASS WITH RECTIFICATION


MOT TEST: 10 November 2015 12:05:57 PASSED
MOT TEST: 10 November 2015 12:05:57 PASSED

This test (392939999729) was completed on the 10 November 2015 12:05:57 and PASSED the requirements for a valid MOT with 0 comments.

This test (392939999729) was completed on the 10 November 2015 12:05:57 and PASSED the requirements for a valid MOT with 0 comments.

Recorded mileage: 7,596

Recorded mileage: 7,596


MOT TEST: 28 October 2014 16:02:06 PASSED
MOT TEST: 28 October 2014 16:02:06 PASSED

This test (217701604356) was completed on the 28 October 2014 16:02:06 and PASSED the requirements for a valid MOT with 0 comments.

This test (217701604356) was completed on the 28 October 2014 16:02:06 and PASSED the requirements for a valid MOT with 0 comments.

Recorded mileage: 7,524

Recorded mileage: 7,524


MOT TEST: 28 October 2014 13:40:01 FAILED
MOT TEST: 28 October 2014 13:40:01 FAILED

This test (989021304309) was completed on the 28 October 2014 13:40:01 and FAILED the requirements for a valid MOT with 2 comments.

This test (989021304309) was completed on the 28 October 2014 13:40:01 and FAILED the requirements for a valid MOT with 2 comments.

Recorded mileage: 7,524

Recorded mileage: 7,524


FAIL


MOT TEST: 06 November 2013 12:17:25 PASSED
MOT TEST: 06 November 2013 12:17:25 PASSED

This test (557930713321) was completed on the 06 November 2013 12:17:25 and PASSED the requirements for a valid MOT with 0 comments.

This test (557930713321) was completed on the 06 November 2013 12:17:25 and PASSED the requirements for a valid MOT with 0 comments.

Recorded mileage: 7,145

Recorded mileage: 7,145


MOT TEST: 06 November 2013 12:17:25 FAILED
MOT TEST: 06 November 2013 12:17:25 FAILED

This test (377330013351) was completed on the 06 November 2013 12:17:25 and FAILED the requirements for a valid MOT with 1 comments.

This test (377330013351) was completed on the 06 November 2013 12:17:25 and FAILED the requirements for a valid MOT with 1 comments.

Recorded mileage: 7,145

Recorded mileage: 7,145


PASS WITH RECTIFICATION


MOT TEST: 13 November 2012 14:41:28 PASSED
MOT TEST: 13 November 2012 14:41:28 PASSED

This test (847138912324) was completed on the 13 November 2012 14:41:28 and PASSED the requirements for a valid MOT with 2 comments.

This test (847138912324) was completed on the 13 November 2012 14:41:28 and PASSED the requirements for a valid MOT with 2 comments.

Recorded mileage: 7,109

Recorded mileage: 7,109


ADVISORY


MOT TEST: 17 November 2011 08:40:34 PASSED
MOT TEST: 17 November 2011 08:40:34 PASSED

This test (676661421319) was completed on the 17 November 2011 08:40:34 and PASSED the requirements for a valid MOT with 0 comments.

This test (676661421319) was completed on the 17 November 2011 08:40:34 and PASSED the requirements for a valid MOT with 0 comments.

Recorded mileage: 7,036

Recorded mileage: 7,036


MOT TEST: 11 November 2011 13:36:36 FAILED
MOT TEST: 11 November 2011 13:36:36 FAILED

This test (485385911321) was completed on the 11 November 2011 13:36:36 and FAILED the requirements for a valid MOT with 3 comments.

This test (485385911321) was completed on the 11 November 2011 13:36:36 and FAILED the requirements for a valid MOT with 3 comments.

Recorded mileage: 7,035

Recorded mileage: 7,035


FAIL


MOT TEST: 27 November 2010 12:13:23 PASSED
MOT TEST: 27 November 2010 12:13:23 PASSED

This test (890741930308) was completed on the 27 November 2010 12:13:23 and PASSED the requirements for a valid MOT with 0 comments.

This test (890741930308) was completed on the 27 November 2010 12:13:23 and PASSED the requirements for a valid MOT with 0 comments.

Recorded mileage: 6,665

Recorded mileage: 6,665


MOT TEST: 27 November 2009 13:40:38 PASSED
MOT TEST: 27 November 2009 13:40:38 PASSED

This test (950191939318) was completed on the 27 November 2009 13:40:38 and PASSED the requirements for a valid MOT with 0 comments.

This test (950191939318) was completed on the 27 November 2009 13:40:38 and PASSED the requirements for a valid MOT with 0 comments.

Recorded mileage: 6,396

Recorded mileage: 6,396


MOT TEST: 27 November 2009 13:40:38 FAILED
MOT TEST: 27 November 2009 13:40:38 FAILED

This test (554481339381) was completed on the 27 November 2009 13:40:38 and FAILED the requirements for a valid MOT with 1 comments.

This test (554481339381) was completed on the 27 November 2009 13:40:38 and FAILED the requirements for a valid MOT with 1 comments.

Recorded mileage: 6,396

Recorded mileage: 6,396


PASS WITH RECTIFICATION


MOT TEST: 19 December 2008 09:15:40 PASSED
MOT TEST: 19 December 2008 09:15:40 PASSED

This test (233734758314) was completed on the 19 December 2008 09:15:40 and PASSED the requirements for a valid MOT with 0 comments.

This test (233734758314) was completed on the 19 December 2008 09:15:40 and PASSED the requirements for a valid MOT with 0 comments.

Recorded mileage: 6,382

Recorded mileage: 6,382


MOT TEST: 19 December 2008 09:15:40 FAILED
MOT TEST: 19 December 2008 09:15:40 FAILED

This test (560654758352) was completed on the 19 December 2008 09:15:40 and FAILED the requirements for a valid MOT with 2 comments.

This test (560654758352) was completed on the 19 December 2008 09:15:40 and FAILED the requirements for a valid MOT with 2 comments.

Recorded mileage: 6,382

Recorded mileage: 6,382


PASS WITH RECTIFICATION


MOT TEST: 04 December 2007 15:39:30 PASSED
MOT TEST: 04 December 2007 15:39:30 PASSED

This test (233598837367) was completed on the 04 December 2007 15:39:30 and PASSED the requirements for a valid MOT with 2 comments.

This test (233598837367) was completed on the 04 December 2007 15:39:30 and PASSED the requirements for a valid MOT with 2 comments.

Recorded mileage: 5,895

Recorded mileage: 5,895


ADVISORY


MOT TEST: 08 November 2006 12:07:49 PASSED
MOT TEST: 08 November 2006 12:07:49 PASSED

This test (413562916386) was completed on the 08 November 2006 12:07:49 and PASSED the requirements for a valid MOT with 1 comments.

This test (413562916386) was completed on the 08 November 2006 12:07:49 and PASSED the requirements for a valid MOT with 1 comments.

Recorded mileage: 5,851

Recorded mileage: 5,851


USER ENTERED