752 FLH


752FLH is registered to a Red 1963, Morris Minor 1000 with a Petrol engine. It Failed its most recent MOT Test on the 23 March 2018

9 unique faults (12 Total) reported in its MOT History (15 Tests).

3 common/recurring faults, the most frequent (2 times) is: Steering system slightly rough (2.2.D.1).

87% (13) MOT Pass Rate and a 13% (2) MOT Failure Rate.

30,620 recorded miles.

752 FLH


752FLH is registered to a Red 1963, Morris Minor 1000 with a Petrol engine. It Failed its most recent MOT Test on the 23 March 2018

9 unique faults (12 Total) reported in its MOT History (15 Tests).

3 common/recurring faults, the most frequent (2 times) is: Steering system slightly rough (2.2.D.1).

87% (13) MOT Pass Rate and a 13% (2) MOT Failure Rate.

30,620 recorded miles.

MOT PASS/Failure rate for 752 FLH

all MOT test results for 752 FLH represented as a percentage
MOT PASS/Failure rate for 752 FLH
all MOT test results for 752 FLH represented as a percentage

PERCENTAGE OF VEHICLE FAULTS WITH 752 FLH

ALL REPORTED FAULTS, DISPLAYED BY PERCENTAGE OF OCCURRENCE DURING ALL MOT TESTS
PERCENTAGE OF VEHICLE FAULTS WITH 752 FLH
ALL REPORTED FAULTS, DISPLAYED BY PERCENTAGE OF OCCURRENCE DURING ALL MOT TESTS
ADVISORY

FAIL

752 FLH annual Faults by type

ALL REPORTED FAULTS, DISPLAYED over time and categorised by type
752 FLH annual Faults by type
ALL REPORTED FAULTS, DISPLAYED over time and categorised by type

RECURRING FAULTS WITH 752 FLH

FAULTS THAT HAVE OCCURED MORE THAN ONCE DURING 752 FLH's MOT HISTORY
RECURRING FAULTS WITH 752 FLH
FAULTS THAT HAVE OCCURED MORE THAN ONCE DURING 752 FLH's MOT HISTORY
Fault Fault Test Date Test Date/Time Reference MOT Test Reference
2 Steering system slightly rough (2.2.d.1) Steering system slightly rough (2.2.d.1) 22 March 2017 [14:56] 22/03/2017 20 March 2017 [11:19] 20/03/2017 436987801998 436987801998 789492315905 789492315905
2 Exhaust has a minor leak of exhaust gases down-pipe (7.1.2) Exhaust has a minor leak of exhaust gases down-pipe (7.1.2) 22 March 2017 [14:56] 22/03/2017 20 March 2017 [11:19] 20/03/2017 436987801998 436987801998 789492315905 789492315905
2 Front exhaust system insecure Front exhaust system insecure 22 March 2017 [14:56] 22/03/2017 20 March 2017 [11:19] 20/03/2017 436987801998 436987801998 789492315905 789492315905

ALL 752 FLH ADVISORIES [6]

ALL ADVISORIES, ORDERED by OCCURRENCE DURING 752 FLH's MOT HISTORY
ALL 752 FLH ADVISORIES [6]
ALL ADVISORIES, ORDERED by OCCURRENCE DURING 752 FLH's MOT HISTORY
Advisory Faults | source www.vehiclestats.co.uk
Fault Fault Test Date Test Date/Time Reference MOT Test Reference
2 Steering system slightly rough (2.2.d.1) Steering system slightly rough (2.2.d.1) 22 March 2017 [14:56] 22/03/2017 20 March 2017 [11:19] 20/03/2017 436987801998 436987801998 789492315905 789492315905
2 Exhaust has a minor leak of exhaust gases down-pipe (7.1.2) Exhaust has a minor leak of exhaust gases down-pipe (7.1.2) 22 March 2017 [14:56] 22/03/2017 20 March 2017 [11:19] 20/03/2017 436987801998 436987801998 789492315905 789492315905
2 Front exhaust system insecure Front exhaust system insecure 22 March 2017 [14:56] 22/03/2017 20 March 2017 [11:19] 20/03/2017 436987801998 436987801998 789492315905 789492315905

ALL 752 FLH Failure Faults [6]

ALL Failure faults, ORDERED by OCCURRENCE DURING 752 FLH's MOT HISTORY
ALL 752 FLH Failure Faults [6]
ALL Failure faults, ORDERED by OCCURRENCE DURING 752 FLH's MOT HISTORY
Advisory Faults | source www.vehiclestats.co.uk
Fault Fault Test Date Test Date/Time Reference MOT Test Reference
1 Nearside headlamp has a product on the lens so that the light output is severely reduced (1.7.5a) Nearside headlamp has a product on the lens so that the light output is severely reduced (1.7.5a) 20 March 2017 [11:19] 20/03/2017 789492315905 789492315905
1 Nearside rear position lamp(s) not working (1.1.a.3b) Nearside rear position lamp(s) not working (1.1.a.3b) 20 March 2017 [11:19] 20/03/2017 789492315905 789492315905
1 Braking system leaking excessive fluid evident around master cylinder - investigation required (3.6.a.1) Braking system leaking excessive fluid evident around master cylinder - investigation required (3.6.a.1) 20 March 2017 [11:19] 20/03/2017 789492315905 789492315905
1 Service brake: efficiency below requirements (3.7.b.7) Service brake: efficiency below requirements (3.7.b.7) 20 March 2017 [11:19] 20/03/2017 789492315905 789492315905
1 Front brakes imbalanced across an axle (3.7.b.5b) Front brakes imbalanced across an axle (3.7.b.5b) 20 March 2017 [11:19] 20/03/2017 789492315905 789492315905
1 Nearside front vehicle structure has excessive corrosion which adversely affects braking or steering (6.1.a.1) Nearside front vehicle structure has excessive corrosion which adversely affects braking or steering (6.1.a.1) 20 March 2009 [09:46] 20/03/2009 912129979016 912129979016

MOT TEST: 23 March 2018 12:18:44 PASSED
MOT TEST: 23 March 2018 12:18:44 PASSED

This test (297242997654) was completed on the 23 March 2018 12:18:44 and PASSED the requirements for a valid MOT with 0 comments.

This test (297242997654) was completed on the 23 March 2018 12:18:44 and PASSED the requirements for a valid MOT with 0 comments.

Recorded mileage: 30,620

Recorded mileage: 30,620


MOT TEST: 22 March 2017 14:56:04 PASSED
MOT TEST: 22 March 2017 14:56:04 PASSED

This test (436987801998) was completed on the 22 March 2017 14:56:04 and PASSED the requirements for a valid MOT with 3 comments.

This test (436987801998) was completed on the 22 March 2017 14:56:04 and PASSED the requirements for a valid MOT with 3 comments.

Recorded mileage: 29,571

Recorded mileage: 29,571


ADVISORY


MOT TEST: 20 March 2017 11:19:24 FAILED
MOT TEST: 20 March 2017 11:19:24 FAILED

This test (789492315905) was completed on the 20 March 2017 11:19:24 and FAILED the requirements for a valid MOT with 8 comments.

This test (789492315905) was completed on the 20 March 2017 11:19:24 and FAILED the requirements for a valid MOT with 8 comments.

Recorded mileage: 29,569

Recorded mileage: 29,569


ADVISORY

FAIL


MOT TEST: 21 March 2016 09:58:55 PASSED
MOT TEST: 21 March 2016 09:58:55 PASSED

This test (621981985744) was completed on the 21 March 2016 09:58:55 and PASSED the requirements for a valid MOT with 0 comments.

This test (621981985744) was completed on the 21 March 2016 09:58:55 and PASSED the requirements for a valid MOT with 0 comments.

Recorded mileage: 28,255

Recorded mileage: 28,255


MOT TEST: 16 March 2015 10:05:03 PASSED
MOT TEST: 16 March 2015 10:05:03 PASSED

This test (165185275022) was completed on the 16 March 2015 10:05:03 and PASSED the requirements for a valid MOT with 0 comments.

This test (165185275022) was completed on the 16 March 2015 10:05:03 and PASSED the requirements for a valid MOT with 0 comments.

Recorded mileage: 26,116

Recorded mileage: 26,116


MOT TEST: 19 March 2014 09:25:51 PASSED
MOT TEST: 19 March 2014 09:25:51 PASSED

This test (929888574035) was completed on the 19 March 2014 09:25:51 and PASSED the requirements for a valid MOT with 0 comments.

This test (929888574035) was completed on the 19 March 2014 09:25:51 and PASSED the requirements for a valid MOT with 0 comments.

Recorded mileage: 24,672

Recorded mileage: 24,672


MOT TEST: 22 March 2013 10:20:20 PASSED
MOT TEST: 22 March 2013 10:20:20 PASSED

This test (117331083487) was completed on the 22 March 2013 10:20:20 and PASSED the requirements for a valid MOT with 0 comments.

This test (117331083487) was completed on the 22 March 2013 10:20:20 and PASSED the requirements for a valid MOT with 0 comments.

Recorded mileage: 23,074

Recorded mileage: 23,074


MOT TEST: 27 March 2012 10:15:06 PASSED
MOT TEST: 27 March 2012 10:15:06 PASSED

This test (116657582056) was completed on the 27 March 2012 10:15:06 and PASSED the requirements for a valid MOT with 0 comments.

This test (116657582056) was completed on the 27 March 2012 10:15:06 and PASSED the requirements for a valid MOT with 0 comments.

Recorded mileage: 21,253

Recorded mileage: 21,253


MOT TEST: 28 March 2011 12:09:17 PASSED
MOT TEST: 28 March 2011 12:09:17 PASSED

This test (379167081053) was completed on the 28 March 2011 12:09:17 and PASSED the requirements for a valid MOT with 0 comments.

This test (379167081053) was completed on the 28 March 2011 12:09:17 and PASSED the requirements for a valid MOT with 0 comments.

Recorded mileage: 19,749

Recorded mileage: 19,749


MOT TEST: 23 March 2010 16:20:22 PASSED
MOT TEST: 23 March 2010 16:20:22 PASSED

This test (352212680090) was completed on the 23 March 2010 16:20:22 and PASSED the requirements for a valid MOT with 0 comments.

This test (352212680090) was completed on the 23 March 2010 16:20:22 and PASSED the requirements for a valid MOT with 0 comments.

Recorded mileage: 18,047

Recorded mileage: 18,047


MOT TEST: 01 April 2009 15:47:23 PASSED
MOT TEST: 01 April 2009 15:47:23 PASSED

This test (171471599084) was completed on the 01 April 2009 15:47:23 and PASSED the requirements for a valid MOT with 0 comments.

This test (171471599084) was completed on the 01 April 2009 15:47:23 and PASSED the requirements for a valid MOT with 0 comments.

Recorded mileage: 16,093

Recorded mileage: 16,093


MOT TEST: 20 March 2009 09:46:51 FAILED
MOT TEST: 20 March 2009 09:46:51 FAILED

This test (912129979016) was completed on the 20 March 2009 09:46:51 and FAILED the requirements for a valid MOT with 1 comments.

This test (912129979016) was completed on the 20 March 2009 09:46:51 and FAILED the requirements for a valid MOT with 1 comments.

Recorded mileage: 16,093

Recorded mileage: 16,093


FAIL


MOT TEST: 19 March 2008 09:47:09 PASSED
MOT TEST: 19 March 2008 09:47:09 PASSED

This test (871099778028) was completed on the 19 March 2008 09:47:09 and PASSED the requirements for a valid MOT with 0 comments.

This test (871099778028) was completed on the 19 March 2008 09:47:09 and PASSED the requirements for a valid MOT with 0 comments.

Recorded mileage: 14,331

Recorded mileage: 14,331


MOT TEST: 22 March 2007 09:50:17 PASSED
MOT TEST: 22 March 2007 09:50:17 PASSED

This test (161141387477) was completed on the 22 March 2007 09:50:17 and PASSED the requirements for a valid MOT with 0 comments.

This test (161141387477) was completed on the 22 March 2007 09:50:17 and PASSED the requirements for a valid MOT with 0 comments.

Recorded mileage: 12,477

Recorded mileage: 12,477


MOT TEST: 22 March 2006 12:14:49 PASSED
MOT TEST: 22 March 2006 12:14:49 PASSED

This test (452231986028) was completed on the 22 March 2006 12:14:49 and PASSED the requirements for a valid MOT with 0 comments.

This test (452231986028) was completed on the 22 March 2006 12:14:49 and PASSED the requirements for a valid MOT with 0 comments.

Recorded mileage: 8,847

Recorded mileage: 8,847