754 XUJ


754XUJ is registered to a Blue 1961, Morris Ld5 with a Petrol engine. It Failed its most recent MOT Test on the 22 March 2018

10 unique faults (10 Total) reported in its MOT History (4 Tests).

0 common/recurring faults.

75% (3) MOT Pass Rate and a 25% (1) MOT Failure Rate.

55,162 recorded miles.

754 XUJ


754XUJ is registered to a Blue 1961, Morris Ld5 with a Petrol engine. It Failed its most recent MOT Test on the 22 March 2018

10 unique faults (10 Total) reported in its MOT History (4 Tests).

0 common/recurring faults.

75% (3) MOT Pass Rate and a 25% (1) MOT Failure Rate.

55,162 recorded miles.

MOT PASS/Failure rate for 754 XUJ

all MOT test results for 754 XUJ represented as a percentage
MOT PASS/Failure rate for 754 XUJ
all MOT test results for 754 XUJ represented as a percentage

PERCENTAGE OF VEHICLE FAULTS WITH 754 XUJ

ALL REPORTED FAULTS, DISPLAYED BY PERCENTAGE OF OCCURRENCE DURING ALL MOT TESTS
PERCENTAGE OF VEHICLE FAULTS WITH 754 XUJ
ALL REPORTED FAULTS, DISPLAYED BY PERCENTAGE OF OCCURRENCE DURING ALL MOT TESTS
ADVISORY

FAIL

754 XUJ annual Faults by type

ALL REPORTED FAULTS, DISPLAYED over time and categorised by type
754 XUJ annual Faults by type
ALL REPORTED FAULTS, DISPLAYED over time and categorised by type

ALL 754 XUJ ADVISORIES [1]

ALL ADVISORIES, ORDERED by OCCURRENCE DURING 754 XUJ's MOT HISTORY
ALL 754 XUJ ADVISORIES [1]
ALL ADVISORIES, ORDERED by OCCURRENCE DURING 754 XUJ's MOT HISTORY
Advisory Faults | source www.vehiclestats.co.uk
Fault Fault Test Date Test Date/Time Reference MOT Test Reference
1 Offside front tyre wall starting to split Offside front tyre wall starting to split 22 March 2018 [14:19] 22/03/2018 136430991017 136430991017

ALL 754 XUJ Failure Faults [9]

ALL Failure faults, ORDERED by OCCURRENCE DURING 754 XUJ's MOT HISTORY
ALL 754 XUJ Failure Faults [9]
ALL Failure faults, ORDERED by OCCURRENCE DURING 754 XUJ's MOT HISTORY
Fail Faults | source www.vehiclestats.co.uk
Fault Fault Test Date Test Date/Time Reference MOT Test Reference
1 Nearside headlamp aim too high (1.8) Nearside headlamp aim too high (1.8) 20 January 2017 [14:48] 20/01/2017 422794121017 422794121017
1 Offside headlamp aim too high (1.8) Offside headlamp aim too high (1.8) 20 January 2017 [14:48] 20/01/2017 422794121017 422794121017
1 Headlamp switch faulty (1.7.1) Headlamp switch faulty (1.7.1) 20 January 2017 [14:48] 20/01/2017 422794121017 422794121017
1 Front brake application uneven (3.7.b.2) Front brake application uneven (3.7.b.2) 20 January 2017 [14:48] 20/01/2017 422794121017 422794121017
1 Nearside rear brake binding (3.7.b.1) Nearside rear brake binding (3.7.b.1) 20 January 2017 [14:48] 20/01/2017 422794121017 422794121017
1 Offside rear brake binding (3.7.b.1) Offside rear brake binding (3.7.b.1) 20 January 2017 [14:48] 20/01/2017 422794121017 422794121017
1 Service brake: efficiency below requirements (3.7.b.7) Service brake: efficiency below requirements (3.7.b.7) 20 January 2017 [14:48] 20/01/2017 422794121017 422794121017
1 Parking brake: efficiency below requirements (3.7.b.7) Parking brake: efficiency below requirements (3.7.b.7) 20 January 2017 [14:48] 20/01/2017 422794121017 422794121017
1 Front brakes imbalanced across an axle (3.7.b.5b) Front brakes imbalanced across an axle (3.7.b.5b) 20 January 2017 [14:48] 20/01/2017 422794121017 422794121017

MOT TEST: 22 March 2018 14:19:48 PASSED
MOT TEST: 22 March 2018 14:19:48 PASSED

This test (136430991017) was completed on the 22 March 2018 14:19:48 and PASSED the requirements for a valid MOT with 1 comments.

This test (136430991017) was completed on the 22 March 2018 14:19:48 and PASSED the requirements for a valid MOT with 1 comments.

Recorded mileage: 55,162

Recorded mileage: 55,162


ADVISORY


MOT TEST: 08 March 2017 14:57:07 PASSED
MOT TEST: 08 March 2017 14:57:07 PASSED

This test (692463608949) was completed on the 08 March 2017 14:57:07 and PASSED the requirements for a valid MOT with 0 comments.

This test (692463608949) was completed on the 08 March 2017 14:57:07 and PASSED the requirements for a valid MOT with 0 comments.

Recorded mileage: 55,162

Recorded mileage: 55,162


MOT TEST: 20 January 2017 14:48:49 FAILED
MOT TEST: 20 January 2017 14:48:49 FAILED

This test (422794121017) was completed on the 20 January 2017 14:48:49 and FAILED the requirements for a valid MOT with 9 comments.

This test (422794121017) was completed on the 20 January 2017 14:48:49 and FAILED the requirements for a valid MOT with 9 comments.

Recorded mileage: 55,162

Recorded mileage: 55,162


FAIL


MOT TEST: 14 September 2007 11:37:38 PASSED
MOT TEST: 14 September 2007 11:37:38 PASSED

This test (513917957258) was completed on the 14 September 2007 11:37:38 and PASSED the requirements for a valid MOT with 0 comments.

This test (513917957258) was completed on the 14 September 2007 11:37:38 and PASSED the requirements for a valid MOT with 0 comments.

Recorded mileage: 55,162

Recorded mileage: 55,162