763 UXR


763UXR is registered to a Maroon 1939, Morris with a Petrol engine. It Failed its most recent MOT Test on the 01 August 2009

9 unique faults (9 Total) reported in its MOT History (3 Tests).

0 common/recurring faults.

67% (2) MOT Pass Rate and a 33% (1) MOT Failure Rate.

37,070 recorded miles.

763 UXR


763UXR is registered to a Maroon 1939, Morris with a Petrol engine. It Failed its most recent MOT Test on the 01 August 2009

9 unique faults (9 Total) reported in its MOT History (3 Tests).

0 common/recurring faults.

67% (2) MOT Pass Rate and a 33% (1) MOT Failure Rate.

37,070 recorded miles.

MOT PASS/Failure rate for 763 UXR

all MOT test results for 763 UXR represented as a percentage
MOT PASS/Failure rate for 763 UXR
all MOT test results for 763 UXR represented as a percentage

PERCENTAGE OF VEHICLE FAULTS WITH 763 UXR

ALL REPORTED FAULTS, DISPLAYED BY PERCENTAGE OF OCCURRENCE DURING ALL MOT TESTS
PERCENTAGE OF VEHICLE FAULTS WITH 763 UXR
ALL REPORTED FAULTS, DISPLAYED BY PERCENTAGE OF OCCURRENCE DURING ALL MOT TESTS
FAIL

763 UXR annual Faults by type

ALL REPORTED FAULTS, DISPLAYED over time and categorised by type
763 UXR annual Faults by type
ALL REPORTED FAULTS, DISPLAYED over time and categorised by type

ALL 763 UXR Failure Faults [9]

ALL Failure faults, ORDERED by OCCURRENCE DURING 763 UXR's MOT HISTORY
ALL 763 UXR Failure Faults [9]
ALL Failure faults, ORDERED by OCCURRENCE DURING 763 UXR's MOT HISTORY
Fail Faults | source www.vehiclestats.co.uk
Fault Fault Test Date Test Date/Time Reference MOT Test Reference
1 Nearside front front position lamp(s) not working (1.1.a.3b) Nearside front front position lamp(s) not working (1.1.a.3b) 11 September 2006 [11:18] 11/09/2006 521354256298 521354256298
1 Nearside rear rear position lamp(s) incorrect colour (1.1.a.3e) Nearside rear rear position lamp(s) incorrect colour (1.1.a.3e) 11 September 2006 [11:18] 11/09/2006 521354256298 521354256298
1 Offside rear rear position lamp(s) incorrect colour (1.1.a.3e) Offside rear rear position lamp(s) incorrect colour (1.1.a.3e) 11 September 2006 [11:18] 11/09/2006 521354256298 521354256298
1 Nearside rear rear position lamp(s) adversely affected by the operation of another lamp (1.1.a.3f) Nearside rear rear position lamp(s) adversely affected by the operation of another lamp (1.1.a.3f) 11 September 2006 [11:18] 11/09/2006 521354256298 521354256298
1 Offside rear rear position lamp(s) adversely affected by the operation of another lamp (1.1.a.3f) Offside rear rear position lamp(s) adversely affected by the operation of another lamp (1.1.a.3f) 11 September 2006 [11:18] 11/09/2006 521354256298 521354256298
1 Exhaust has a part missing (7.1.1a) Exhaust has a part missing (7.1.1a) 11 September 2006 [11:18] 11/09/2006 521354256298 521354256298
1 Rear brake hose twisted (3.6.b.4c) Rear brake hose twisted (3.6.b.4c) 11 September 2006 [11:18] 11/09/2006 521354256298 521354256298
1 Rear brake hose excessively deteriorated (3.6.b.4d) Rear brake hose excessively deteriorated (3.6.b.4d) 11 September 2006 [11:18] 11/09/2006 521354256298 521354256298
1 Brakes imbalanced across an axle (3.7.b.5b) Brakes imbalanced across an axle (3.7.b.5b) 11 September 2006 [11:18] 11/09/2006 521354256298 521354256298

MOT TEST: 01 August 2009 08:25:15 PASSED
MOT TEST: 01 August 2009 08:25:15 PASSED

This test (353463119434) was completed on the 01 August 2009 08:25:15 and PASSED the requirements for a valid MOT with 0 comments.

This test (353463119434) was completed on the 01 August 2009 08:25:15 and PASSED the requirements for a valid MOT with 0 comments.

Recorded mileage: 37,070

Recorded mileage: 37,070


MOT TEST: 02 October 2006 15:57:09 PASSED
MOT TEST: 02 October 2006 15:57:09 PASSED

This test (384175576486) was completed on the 02 October 2006 15:57:09 and PASSED the requirements for a valid MOT with 0 comments.

This test (384175576486) was completed on the 02 October 2006 15:57:09 and PASSED the requirements for a valid MOT with 0 comments.

Recorded mileage: 36,478

Recorded mileage: 36,478


MOT TEST: 11 September 2006 11:18:12 FAILED
MOT TEST: 11 September 2006 11:18:12 FAILED

This test (521354256298) was completed on the 11 September 2006 11:18:12 and FAILED the requirements for a valid MOT with 9 comments.

This test (521354256298) was completed on the 11 September 2006 11:18:12 and FAILED the requirements for a valid MOT with 9 comments.

Recorded mileage: 36,478

Recorded mileage: 36,478


FAIL