766 FHW


766FHW is registered to a Blue 1959, Morris Minor 1000 with a Petrol engine. It Failed its most recent MOT Test on the 08 November 2017

14 unique faults (16 Total) reported in its MOT History (10 Tests).

2 common/recurring faults, the most frequent (2 times) is: Front both front tyres perished.

70% (7) MOT Pass Rate and a 30% (3) MOT Failure Rate.

26,717 recorded miles.

766 FHW


766FHW is registered to a Blue 1959, Morris Minor 1000 with a Petrol engine. It Failed its most recent MOT Test on the 08 November 2017

14 unique faults (16 Total) reported in its MOT History (10 Tests).

2 common/recurring faults, the most frequent (2 times) is: Front both front tyres perished.

70% (7) MOT Pass Rate and a 30% (3) MOT Failure Rate.

26,717 recorded miles.

MOT PASS/Failure rate for 766 FHW

all MOT test results for 766 FHW represented as a percentage
MOT PASS/Failure rate for 766 FHW
all MOT test results for 766 FHW represented as a percentage

PERCENTAGE OF VEHICLE FAULTS WITH 766 FHW

ALL REPORTED FAULTS, DISPLAYED BY PERCENTAGE OF OCCURRENCE DURING ALL MOT TESTS
PERCENTAGE OF VEHICLE FAULTS WITH 766 FHW
ALL REPORTED FAULTS, DISPLAYED BY PERCENTAGE OF OCCURRENCE DURING ALL MOT TESTS
ADVISORY

FAIL

PASS WITH RECTIFICATION

766 FHW annual Faults by type

ALL REPORTED FAULTS, DISPLAYED over time and categorised by type
766 FHW annual Faults by type
ALL REPORTED FAULTS, DISPLAYED over time and categorised by type

RECURRING FAULTS WITH 766 FHW

FAULTS THAT HAVE OCCURED MORE THAN ONCE DURING 766 FHW's MOT HISTORY
RECURRING FAULTS WITH 766 FHW
FAULTS THAT HAVE OCCURED MORE THAN ONCE DURING 766 FHW's MOT HISTORY
Fault Fault Test Date Test Date/Time Reference MOT Test Reference
2 Front both front tyres perished Front both front tyres perished 08 November 2017 [16:56] 08/11/2017 31 October 2017 [12:25] 31/10/2017 531312321003 531312321003 844423250154 844423250154
2 Parking brake: efficiency below requirements (3.7.b.7) Parking brake: efficiency below requirements (3.7.b.7) 31 October 2017 [12:25] 31/10/2017 06 May 2011 [17:35] 06/05/2011 844423250154 844423250154 647166921112 647166921112

ALL 766 FHW ADVISORIES [5]

ALL ADVISORIES, ORDERED by OCCURRENCE DURING 766 FHW's MOT HISTORY
ALL 766 FHW ADVISORIES [5]
ALL ADVISORIES, ORDERED by OCCURRENCE DURING 766 FHW's MOT HISTORY
Advisory Faults | source www.vehiclestats.co.uk
Fault Fault Test Date Test Date/Time Reference MOT Test Reference
2 Front both front tyres perished Front both front tyres perished 08 November 2017 [16:56] 08/11/2017 31 October 2017 [12:25] 31/10/2017 531312321003 531312321003 844423250154 844423250154
1 Nearside rear leaf spring has a slightly deteriorated shackle pin rubber bush not resulting in excessive movement (2.4.b.2) Nearside rear leaf spring has a slightly deteriorated shackle pin rubber bush not resulting in excessive movement (2.4.b.2) 06 May 2011 [17:35] 06/05/2011 647166921112 647166921112
1 Offside rear leaf spring has a slightly deteriorated shackle pin rubber bush not resulting in excessive movement (2.4.b.2) Offside rear leaf spring has a slightly deteriorated shackle pin rubber bush not resulting in excessive movement (2.4.b.2) 06 May 2011 [17:35] 06/05/2011 647166921112 647166921112
1 Offside front suspension component mounting prescribed area is corroded but not considered excessive (2.4.a.3) Offside front suspension component mounting prescribed area is corroded but not considered excessive (2.4.a.3) 06 May 2011 [17:35] 06/05/2011 647166921112 647166921112

ALL 766 FHW Failure Faults [9]

ALL Failure faults, ORDERED by OCCURRENCE DURING 766 FHW's MOT HISTORY
ALL 766 FHW Failure Faults [9]
ALL Failure faults, ORDERED by OCCURRENCE DURING 766 FHW's MOT HISTORY
Fail Faults | source www.vehiclestats.co.uk
Fault Fault Test Date Test Date/Time Reference MOT Test Reference
2 Parking brake: efficiency below requirements (3.7.b.7) Parking brake: efficiency below requirements (3.7.b.7) 31 October 2017 [12:25] 31/10/2017 06 May 2011 [17:35] 06/05/2011 844423250154 844423250154 647166921112 647166921112
1 Nearside front position lamp(s) not working (1.1.a.3b) Nearside front position lamp(s) not working (1.1.a.3b) 31 October 2017 [12:25] 31/10/2017 844423250154 844423250154
1 Horn not working (1.6.2a) Horn not working (1.6.2a) 31 October 2017 [12:25] 31/10/2017 844423250154 844423250154
1 Offside rear brake binding (3.7.b.1) Offside rear brake binding (3.7.b.1) 31 October 2017 [12:25] 31/10/2017 844423250154 844423250154
1 Service brake: efficiency below requirements (3.7.b.7) Service brake: efficiency below requirements (3.7.b.7) 31 October 2017 [12:25] 31/10/2017 844423250154 844423250154
1 Front registration plate deteriorated (6.3.1d) Front registration plate deteriorated (6.3.1d) 06 May 2011 [17:35] 06/05/2011 647166921112 647166921112
1 Nearside rear body has a sharp edge caused by corrosion (6.1.c.1) Nearside rear body has a sharp edge caused by corrosion (6.1.c.1) 06 May 2011 [17:35] 06/05/2011 647166921112 647166921112
1 Nearside suspension spring mounting prescribed area is excessively corroded (2.4.a.3) Nearside suspension spring mounting prescribed area is excessively corroded (2.4.a.3) 06 May 2011 [17:35] 06/05/2011 647166921112 647166921112

ALL 766 FHW Pass With Rectification Faults [2]

ALL Pass With Rectification faults, ORDERED by OCCURRENCE DURING 766 FHW's MOT HISTORY
ALL 766 FHW Pass With Rectification Faults [2]
ALL Pass With Rectification faults, ORDERED by OCCURRENCE DURING 766 FHW's MOT HISTORY
Pass With Rectification Faults | source www.vehiclestats.co.uk
Fault Fault Test Date Test Date/Time Reference MOT Test Reference
1 Nearside rear suspension spring mounting prescribed area is excessively corroded (2.4.a.3) Nearside rear suspension spring mounting prescribed area is excessively corroded (2.4.a.3) 29 April 2009 [12:15] 29/04/2009 972919019155 972919019155
1 Offside rear suspension spring mounting prescribed area is excessively corroded (2.4.a.3) Offside rear suspension spring mounting prescribed area is excessively corroded (2.4.a.3) 29 April 2009 [12:15] 29/04/2009 972919019155 972919019155

MOT TEST: 08 November 2017 16:56:31 PASSED
MOT TEST: 08 November 2017 16:56:31 PASSED

This test (531312321003) was completed on the 08 November 2017 16:56:31 and PASSED the requirements for a valid MOT with 1 comments.

This test (531312321003) was completed on the 08 November 2017 16:56:31 and PASSED the requirements for a valid MOT with 1 comments.

Recorded mileage: 26,717

Recorded mileage: 26,717


ADVISORY


MOT TEST: 31 October 2017 12:25:14 FAILED
MOT TEST: 31 October 2017 12:25:14 FAILED

This test (844423250154) was completed on the 31 October 2017 12:25:14 and FAILED the requirements for a valid MOT with 6 comments.

This test (844423250154) was completed on the 31 October 2017 12:25:14 and FAILED the requirements for a valid MOT with 6 comments.

Recorded mileage: 26,717

Recorded mileage: 26,717


ADVISORY

FAIL


MOT TEST: 12 May 2011 11:22:55 PASSED
MOT TEST: 12 May 2011 11:22:55 PASSED

This test (897302831164) was completed on the 12 May 2011 11:22:55 and PASSED the requirements for a valid MOT with 0 comments.

This test (897302831164) was completed on the 12 May 2011 11:22:55 and PASSED the requirements for a valid MOT with 0 comments.

Recorded mileage: 26,717

Recorded mileage: 26,717


MOT TEST: 06 May 2011 17:35:29 FAILED
MOT TEST: 06 May 2011 17:35:29 FAILED

This test (647166921112) was completed on the 06 May 2011 17:35:29 and FAILED the requirements for a valid MOT with 7 comments.

This test (647166921112) was completed on the 06 May 2011 17:35:29 and FAILED the requirements for a valid MOT with 7 comments.

Recorded mileage: 26,717

Recorded mileage: 26,717


ADVISORY

FAIL


MOT TEST: 07 May 2010 08:53:04 PASSED
MOT TEST: 07 May 2010 08:53:04 PASSED

This test (100156520174) was completed on the 07 May 2010 08:53:04 and PASSED the requirements for a valid MOT with 0 comments.

This test (100156520174) was completed on the 07 May 2010 08:53:04 and PASSED the requirements for a valid MOT with 0 comments.

Recorded mileage: 26,717

Recorded mileage: 26,717


MOT TEST: 29 April 2009 12:15:24 PASSED
MOT TEST: 29 April 2009 12:15:24 PASSED

This test (292749719198) was completed on the 29 April 2009 12:15:24 and PASSED the requirements for a valid MOT with 0 comments.

This test (292749719198) was completed on the 29 April 2009 12:15:24 and PASSED the requirements for a valid MOT with 0 comments.

Recorded mileage: 26,717

Recorded mileage: 26,717


MOT TEST: 29 April 2009 12:15:24 FAILED
MOT TEST: 29 April 2009 12:15:24 FAILED

This test (972919019155) was completed on the 29 April 2009 12:15:24 and FAILED the requirements for a valid MOT with 2 comments.

This test (972919019155) was completed on the 29 April 2009 12:15:24 and FAILED the requirements for a valid MOT with 2 comments.

Recorded mileage: 26,717

Recorded mileage: 26,717


PASS WITH RECTIFICATION


MOT TEST: 25 April 2008 13:15:13 PASSED
MOT TEST: 25 April 2008 13:15:13 PASSED

This test (262726118171) was completed on the 25 April 2008 13:15:13 and PASSED the requirements for a valid MOT with 0 comments.

This test (262726118171) was completed on the 25 April 2008 13:15:13 and PASSED the requirements for a valid MOT with 0 comments.

Recorded mileage: 26,717

Recorded mileage: 26,717


MOT TEST: 30 April 2007 17:50:04 PASSED
MOT TEST: 30 April 2007 17:50:04 PASSED

This test (752590527132) was completed on the 30 April 2007 17:50:04 and PASSED the requirements for a valid MOT with 0 comments.

This test (752590527132) was completed on the 30 April 2007 17:50:04 and PASSED the requirements for a valid MOT with 0 comments.

Recorded mileage: 26,717

Recorded mileage: 26,717


MOT TEST: 19 May 2006 10:06:54 PASSED
MOT TEST: 19 May 2006 10:06:54 PASSED

This test (522589736144) was completed on the 19 May 2006 10:06:54 and PASSED the requirements for a valid MOT with 0 comments.

This test (522589736144) was completed on the 19 May 2006 10:06:54 and PASSED the requirements for a valid MOT with 0 comments.

Recorded mileage: 26,717

Recorded mileage: 26,717