767 FAY


767FAY is registered to a Red 1935, Morris 8 with a Petrol engine. It Failed its most recent MOT Test on the 11 August 2017

10 unique faults (12 Total) reported in its MOT History (16 Tests).

2 common/recurring faults, the most frequent (2 times) is: Nearside Stop lamp not working (1.2.1b).

75% (12) MOT Pass Rate and a 25% (4) MOT Failure Rate.

844,940 recorded miles.

767 FAY


767FAY is registered to a Red 1935, Morris 8 with a Petrol engine. It Failed its most recent MOT Test on the 11 August 2017

10 unique faults (12 Total) reported in its MOT History (16 Tests).

2 common/recurring faults, the most frequent (2 times) is: Nearside Stop lamp not working (1.2.1b).

75% (12) MOT Pass Rate and a 25% (4) MOT Failure Rate.

844,940 recorded miles.

MOT PASS/Failure rate for 767 FAY

all MOT test results for 767 FAY represented as a percentage
MOT PASS/Failure rate for 767 FAY
all MOT test results for 767 FAY represented as a percentage

PERCENTAGE OF VEHICLE FAULTS WITH 767 FAY

ALL REPORTED FAULTS, DISPLAYED BY PERCENTAGE OF OCCURRENCE DURING ALL MOT TESTS
PERCENTAGE OF VEHICLE FAULTS WITH 767 FAY
ALL REPORTED FAULTS, DISPLAYED BY PERCENTAGE OF OCCURRENCE DURING ALL MOT TESTS
ADVISORY

FAIL

USER ENTERED

PASS WITH RECTIFICATION

767 FAY annual Faults by type

ALL REPORTED FAULTS, DISPLAYED over time and categorised by type
767 FAY annual Faults by type
ALL REPORTED FAULTS, DISPLAYED over time and categorised by type

RECURRING FAULTS WITH 767 FAY

FAULTS THAT HAVE OCCURED MORE THAN ONCE DURING 767 FAY's MOT HISTORY
RECURRING FAULTS WITH 767 FAY
FAULTS THAT HAVE OCCURED MORE THAN ONCE DURING 767 FAY's MOT HISTORY
Fault Fault Test Date Test Date/Time Reference MOT Test Reference
2 Nearside stop lamp not working (1.2.1b) Nearside stop lamp not working (1.2.1b) 18 July 2014 [17:09] 18/07/2014 12 July 2011 [15:04] 12/07/2011 276059694422 276059694422 519983791143 519983791143
2 Nearside track rod end ball joint has slight play (2.2.b.1f) Nearside track rod end ball joint has slight play (2.2.b.1f) 13 July 2013 [09:01] 13/07/2013 12 July 2012 [09:27] 12/07/2012 655094493179 655094493179 847384792167 847384792167

ALL 767 FAY ADVISORIES [4]

ALL ADVISORIES, ORDERED by OCCURRENCE DURING 767 FAY's MOT HISTORY
ALL 767 FAY ADVISORIES [4]
ALL ADVISORIES, ORDERED by OCCURRENCE DURING 767 FAY's MOT HISTORY
Advisory Faults | source www.vehiclestats.co.uk
Fault Fault Test Date Test Date/Time Reference MOT Test Reference
2 Nearside track rod end ball joint has slight play (2.2.b.1f) Nearside track rod end ball joint has slight play (2.2.b.1f) 13 July 2013 [09:01] 13/07/2013 12 July 2012 [09:27] 12/07/2012 655094493179 655094493179 847384792167 847384792167
1 Nearside drag link end ball joint has slight play (2.2.b.1f) Nearside drag link end ball joint has slight play (2.2.b.1f) 13 July 2013 [09:01] 13/07/2013 655094493179 655094493179
1 Parking brake: parking brake efficiency only just met. It would appear that the braking system requires adjustment or repair. (3.7.c.1b) Parking brake: parking brake efficiency only just met. It would appear that the braking system requires adjustment or repair. (3.7.c.1b) 12 July 2011 [15:04] 12/07/2011 519983791143 519983791143

ALL 767 FAY Failure Faults [5]

ALL Failure faults, ORDERED by OCCURRENCE DURING 767 FAY's MOT HISTORY
ALL 767 FAY Failure Faults [5]
ALL Failure faults, ORDERED by OCCURRENCE DURING 767 FAY's MOT HISTORY
Fail Faults | source www.vehiclestats.co.uk
Fault Fault Test Date Test Date/Time Reference MOT Test Reference
2 Nearside stop lamp not working (1.2.1b) Nearside stop lamp not working (1.2.1b) 18 July 2014 [17:09] 18/07/2014 12 July 2011 [15:04] 12/07/2011 276059694422 276059694422 519983791143 519983791143
1 Nearside rear rear brake binding (3.7.b.1) Nearside rear rear brake binding (3.7.b.1) 18 July 2014 [17:09] 18/07/2014 276059694422 276059694422
1 Nearside rear position lamp(s) not working (1.1.a.3b) Nearside rear position lamp(s) not working (1.1.a.3b) 12 July 2011 [15:04] 12/07/2011 519983791143 519983791143
1 Offside stop lamp not working (1.2.1b) Offside stop lamp not working (1.2.1b) 12 July 2011 [15:04] 12/07/2011 519983791143 519983791143

ALL 767 FAY User Entered Faults [1]

ALL User Entered faults, ORDERED by OCCURRENCE DURING 767 FAY's MOT HISTORY
ALL 767 FAY User Entered Faults [1]
ALL User Entered faults, ORDERED by OCCURRENCE DURING 767 FAY's MOT HISTORY
User Entered Faults | source www.vehiclestats.co.uk
Fault Fault Test Date Test Date/Time Reference MOT Test Reference
1 Slight play in n/s/f drag linkouter joint Slight play in n/s/f drag linkouter joint 14 July 2008 [17:27] 14/07/2008 704806198133 704806198133

ALL 767 FAY Pass With Rectification Faults [2]

ALL Pass With Rectification faults, ORDERED by OCCURRENCE DURING 767 FAY's MOT HISTORY
ALL 767 FAY Pass With Rectification Faults [2]
ALL Pass With Rectification faults, ORDERED by OCCURRENCE DURING 767 FAY's MOT HISTORY
Pass With Rectification Faults | source www.vehiclestats.co.uk
Fault Fault Test Date Test Date/Time Reference MOT Test Reference
1 Offside headlamp not working on main beam (1.7.5a) Offside headlamp not working on main beam (1.7.5a) 11 August 2017 [10:06] 11/08/2017 799543610004 799543610004
1 Nearside headlamp aim beam image obviously incorrect (1.8.a.1b) Nearside headlamp aim beam image obviously incorrect (1.8.a.1b) 13 August 2015 [15:48] 13/08/2015 450983092378 450983092378

MOT TEST: 11 August 2017 10:06:35 PASSED
MOT TEST: 11 August 2017 10:06:35 PASSED

This test (167282290845) was completed on the 11 August 2017 10:06:35 and PASSED the requirements for a valid MOT with 0 comments.

This test (167282290845) was completed on the 11 August 2017 10:06:35 and PASSED the requirements for a valid MOT with 0 comments.

Recorded mileage: 90,623

Recorded mileage: 90,623


MOT TEST: 11 August 2017 10:06:34 FAILED
MOT TEST: 11 August 2017 10:06:34 FAILED

This test (799543610004) was completed on the 11 August 2017 10:06:34 and FAILED the requirements for a valid MOT with 1 comments.

This test (799543610004) was completed on the 11 August 2017 10:06:34 and FAILED the requirements for a valid MOT with 1 comments.

Recorded mileage: 90,623

Recorded mileage: 90,623


PASS WITH RECTIFICATION


MOT TEST: 31 August 2016 10:19:47 PASSED
MOT TEST: 31 August 2016 10:19:47 PASSED

This test (389173509906) was completed on the 31 August 2016 10:19:47 and PASSED the requirements for a valid MOT with 0 comments.

This test (389173509906) was completed on the 31 August 2016 10:19:47 and PASSED the requirements for a valid MOT with 0 comments.

Recorded mileage: 87,416

Recorded mileage: 87,416


MOT TEST: 13 August 2015 15:48:02 PASSED
MOT TEST: 13 August 2015 15:48:02 PASSED

This test (157513199890) was completed on the 13 August 2015 15:48:02 and PASSED the requirements for a valid MOT with 0 comments.

This test (157513199890) was completed on the 13 August 2015 15:48:02 and PASSED the requirements for a valid MOT with 0 comments.

Recorded mileage: 844,940

Recorded mileage: 844,940


MOT TEST: 13 August 2015 15:48:01 FAILED
MOT TEST: 13 August 2015 15:48:01 FAILED

This test (450983092378) was completed on the 13 August 2015 15:48:01 and FAILED the requirements for a valid MOT with 1 comments.

This test (450983092378) was completed on the 13 August 2015 15:48:01 and FAILED the requirements for a valid MOT with 1 comments.

Recorded mileage: 844,940

Recorded mileage: 844,940


PASS WITH RECTIFICATION


MOT TEST: 05 September 2014 09:07:22 PASSED
MOT TEST: 05 September 2014 09:07:22 PASSED

This test (186288644234) was completed on the 05 September 2014 09:07:22 and PASSED the requirements for a valid MOT with 0 comments.

This test (186288644234) was completed on the 05 September 2014 09:07:22 and PASSED the requirements for a valid MOT with 0 comments.

Recorded mileage: 84,252

Recorded mileage: 84,252


MOT TEST: 18 July 2014 17:09:46 FAILED
MOT TEST: 18 July 2014 17:09:46 FAILED

This test (276059694422) was completed on the 18 July 2014 17:09:46 and FAILED the requirements for a valid MOT with 2 comments.

This test (276059694422) was completed on the 18 July 2014 17:09:46 and FAILED the requirements for a valid MOT with 2 comments.

Recorded mileage: 84,252

Recorded mileage: 84,252


FAIL


MOT TEST: 13 July 2013 09:01:10 PASSED
MOT TEST: 13 July 2013 09:01:10 PASSED

This test (655094493179) was completed on the 13 July 2013 09:01:10 and PASSED the requirements for a valid MOT with 2 comments.

This test (655094493179) was completed on the 13 July 2013 09:01:10 and PASSED the requirements for a valid MOT with 2 comments.

Recorded mileage: 84,150

Recorded mileage: 84,150


ADVISORY


MOT TEST: 12 July 2012 09:27:25 PASSED
MOT TEST: 12 July 2012 09:27:25 PASSED

This test (847384792167) was completed on the 12 July 2012 09:27:25 and PASSED the requirements for a valid MOT with 1 comments.

This test (847384792167) was completed on the 12 July 2012 09:27:25 and PASSED the requirements for a valid MOT with 1 comments.

Recorded mileage: 84,079

Recorded mileage: 84,079


ADVISORY


MOT TEST: 16 July 2011 09:33:31 PASSED
MOT TEST: 16 July 2011 09:33:31 PASSED

This test (857897391120) was completed on the 16 July 2011 09:33:31 and PASSED the requirements for a valid MOT with 0 comments.

This test (857897391120) was completed on the 16 July 2011 09:33:31 and PASSED the requirements for a valid MOT with 0 comments.

Recorded mileage: 84,006

Recorded mileage: 84,006


MOT TEST: 12 July 2011 15:04:45 FAILED
MOT TEST: 12 July 2011 15:04:45 FAILED

This test (519983791143) was completed on the 12 July 2011 15:04:45 and FAILED the requirements for a valid MOT with 4 comments.

This test (519983791143) was completed on the 12 July 2011 15:04:45 and FAILED the requirements for a valid MOT with 4 comments.

Recorded mileage: 84,006

Recorded mileage: 84,006


ADVISORY

FAIL


MOT TEST: 16 July 2010 15:07:51 PASSED
MOT TEST: 16 July 2010 15:07:51 PASSED

This test (571557090195) was completed on the 16 July 2010 15:07:51 and PASSED the requirements for a valid MOT with 0 comments.

This test (571557090195) was completed on the 16 July 2010 15:07:51 and PASSED the requirements for a valid MOT with 0 comments.

Recorded mileage: 83,930

Recorded mileage: 83,930


MOT TEST: 04 July 2009 13:39:16 PASSED
MOT TEST: 04 July 2009 13:39:16 PASSED

This test (101555989193) was completed on the 04 July 2009 13:39:16 and PASSED the requirements for a valid MOT with 0 comments.

This test (101555989193) was completed on the 04 July 2009 13:39:16 and PASSED the requirements for a valid MOT with 0 comments.

Recorded mileage: 83,832

Recorded mileage: 83,832


MOT TEST: 14 July 2008 17:27:00 PASSED
MOT TEST: 14 July 2008 17:27:00 PASSED

This test (704806198133) was completed on the 14 July 2008 17:27:00 and PASSED the requirements for a valid MOT with 1 comments.

This test (704806198133) was completed on the 14 July 2008 17:27:00 and PASSED the requirements for a valid MOT with 1 comments.

Recorded mileage: 83,703

Recorded mileage: 83,703


USER ENTERED


MOT TEST: 14 July 2007 10:36:46 PASSED
MOT TEST: 14 July 2007 10:36:46 PASSED

This test (751745897182) was completed on the 14 July 2007 10:36:46 and PASSED the requirements for a valid MOT with 0 comments.

This test (751745897182) was completed on the 14 July 2007 10:36:46 and PASSED the requirements for a valid MOT with 0 comments.

Recorded mileage: 83,444

Recorded mileage: 83,444


MOT TEST: 19 May 2006 15:11:45 PASSED
MOT TEST: 19 May 2006 15:11:45 PASSED

This test (304499236176) was completed on the 19 May 2006 15:11:45 and PASSED the requirements for a valid MOT with 0 comments.

This test (304499236176) was completed on the 19 May 2006 15:11:45 and PASSED the requirements for a valid MOT with 0 comments.

Recorded mileage: 83,228

Recorded mileage: 83,228