768 7EL


7687EL is registered to a Red 1959, Morris Mini with a Petrol engine. It Passed its most recent MOT Test on the 25 May 2018

14 unique faults (15 Total) reported in its MOT History (15 Tests).

1 common/recurring faults.

80% (12) MOT Pass Rate and a 20% (3) MOT Failure Rate.

694,055 recorded miles.

768 7EL


7687EL is registered to a Red 1959, Morris Mini with a Petrol engine. It Passed its most recent MOT Test on the 25 May 2018

14 unique faults (15 Total) reported in its MOT History (15 Tests).

1 common/recurring faults.

80% (12) MOT Pass Rate and a 20% (3) MOT Failure Rate.

694,055 recorded miles.

MOT PASS/Failure rate for 768 7EL

all MOT test results for 768 7EL represented as a percentage
MOT PASS/Failure rate for 768 7EL
all MOT test results for 768 7EL represented as a percentage

PERCENTAGE OF VEHICLE FAULTS WITH 768 7EL

ALL REPORTED FAULTS, DISPLAYED BY PERCENTAGE OF OCCURRENCE DURING ALL MOT TESTS
PERCENTAGE OF VEHICLE FAULTS WITH 768 7EL
ALL REPORTED FAULTS, DISPLAYED BY PERCENTAGE OF OCCURRENCE DURING ALL MOT TESTS
ADVISORY

FAIL

768 7EL annual Faults by type

ALL REPORTED FAULTS, DISPLAYED over time and categorised by type
768 7EL annual Faults by type
ALL REPORTED FAULTS, DISPLAYED over time and categorised by type

ALL 768 7EL ADVISORIES [2]

ALL ADVISORIES, ORDERED by OCCURRENCE DURING 768 7EL's MOT HISTORY
ALL 768 7EL ADVISORIES [2]
ALL ADVISORIES, ORDERED by OCCURRENCE DURING 768 7EL's MOT HISTORY
Advisory Faults | source www.vehiclestats.co.uk
Fault Fault Test Date Test Date/Time Reference MOT Test Reference
1 Nearside inner front constant velocity joint gaiter damaged, but preventing the ingress of dirt (2.5.c.1a) Nearside inner front constant velocity joint gaiter damaged, but preventing the ingress of dirt (2.5.c.1a) 17 February 2017 [10:57] 17/02/2017 187312660163 187312660163
1 Nearside front tie bar/rod rubber bush deteriorated but not resulting in excessive movement (2.4.g.2) Nearside front tie bar/rod rubber bush deteriorated but not resulting in excessive movement (2.4.g.2) 17 February 2017 [10:57] 17/02/2017 187312660163 187312660163

ALL 768 7EL Failure Faults [13]

ALL Failure faults, ORDERED by OCCURRENCE DURING 768 7EL's MOT HISTORY
ALL 768 7EL Failure Faults [13]
ALL Failure faults, ORDERED by OCCURRENCE DURING 768 7EL's MOT HISTORY
Fail Faults | source www.vehiclestats.co.uk
Fault Fault Test Date Test Date/Time Reference MOT Test Reference
2 Parking brake: efficiency below requirements (3.7.b.7) Parking brake: efficiency below requirements (3.7.b.7) 28 February 2011 [13:54] 28/02/2011 04 June 2007 [15:17] 04/06/2007 268439151038 268439151038 992675157119 992675157119
1 Offside headlamp aim too high (1.8) Offside headlamp aim too high (1.8) 27 April 2018 [10:01] 27/04/2018 594725578004 594725578004
1 Nearside indicator tell tale inoperative (1.4.a.2a) Nearside indicator tell tale inoperative (1.4.a.2a) 27 April 2018 [10:01] 27/04/2018 594725578004 594725578004
1 Rear brakes imbalanced across an axle axle 2 (3.7.b.5b) Rear brakes imbalanced across an axle axle 2 (3.7.b.5b) 27 April 2018 [10:01] 27/04/2018 594725578004 594725578004
1 Nearside rear rear brake recording little or no effort (3.7.b.5a) Nearside rear rear brake recording little or no effort (3.7.b.5a) 28 February 2011 [13:54] 28/02/2011 268439151038 268439151038
1 Offside rear rear brake recording little or no effort (3.7.b.5a) Offside rear rear brake recording little or no effort (3.7.b.5a) 28 February 2011 [13:54] 28/02/2011 268439151038 268439151038
1 Rear rear parking brake recording little or no effort (3.7.b.6a) Rear rear parking brake recording little or no effort (3.7.b.6a) 28 February 2011 [13:54] 28/02/2011 268439151038 268439151038
1 Service brake: efficiency below requirements (3.7.b.7) Service brake: efficiency below requirements (3.7.b.7) 28 February 2011 [13:54] 28/02/2011 268439151038 268439151038
1 Nearside front passenger door cannot be opened from inside the vehicle (6.2.b.1b) Nearside front passenger door cannot be opened from inside the vehicle (6.2.b.1b) 04 June 2007 [15:17] 04/06/2007 992675157119 992675157119
1 Front windscreen washer provides insufficient washer liquid (8.2.3) Front windscreen washer provides insufficient washer liquid (8.2.3) 04 June 2007 [15:17] 04/06/2007 992675157119 992675157119
1 Nearside rear brake recording little or no effort (3.7.b.5a) Nearside rear brake recording little or no effort (3.7.b.5a) 04 June 2007 [15:17] 04/06/2007 992675157119 992675157119
1 Nearside rear parking brake recording little or no effort (3.7.b.6a) Nearside rear parking brake recording little or no effort (3.7.b.6a) 04 June 2007 [15:17] 04/06/2007 992675157119 992675157119

MOT TEST: 25 May 2018 10:14:57 PASSED
MOT TEST: 25 May 2018 10:14:57 PASSED

This test (787044170309) was completed on the 25 May 2018 10:14:57 and PASSED the requirements for a valid MOT with 0 comments.

This test (787044170309) was completed on the 25 May 2018 10:14:57 and PASSED the requirements for a valid MOT with 0 comments.

Recorded mileage: 70,519

Recorded mileage: 70,519


MOT TEST: 27 April 2018 10:01:07 FAILED
MOT TEST: 27 April 2018 10:01:07 FAILED

This test (594725578004) was completed on the 27 April 2018 10:01:07 and FAILED the requirements for a valid MOT with 3 comments.

This test (594725578004) was completed on the 27 April 2018 10:01:07 and FAILED the requirements for a valid MOT with 3 comments.

Recorded mileage: 70,515

Recorded mileage: 70,515


FAIL


MOT TEST: 17 February 2017 10:57:57 PASSED
MOT TEST: 17 February 2017 10:57:57 PASSED

This test (187312660163) was completed on the 17 February 2017 10:57:57 and PASSED the requirements for a valid MOT with 2 comments.

This test (187312660163) was completed on the 17 February 2017 10:57:57 and PASSED the requirements for a valid MOT with 2 comments.

Recorded mileage: 70,341

Recorded mileage: 70,341


ADVISORY


MOT TEST: 23 February 2016 15:33:19 PASSED
MOT TEST: 23 February 2016 15:33:19 PASSED

This test (833704859212) was completed on the 23 February 2016 15:33:19 and PASSED the requirements for a valid MOT with 0 comments.

This test (833704859212) was completed on the 23 February 2016 15:33:19 and PASSED the requirements for a valid MOT with 0 comments.

Recorded mileage: 70,004

Recorded mileage: 70,004


MOT TEST: 09 February 2015 17:41:29 PASSED
MOT TEST: 09 February 2015 17:41:29 PASSED

This test (687350245013) was completed on the 09 February 2015 17:41:29 and PASSED the requirements for a valid MOT with 0 comments.

This test (687350245013) was completed on the 09 February 2015 17:41:29 and PASSED the requirements for a valid MOT with 0 comments.

Recorded mileage: 70,000

Recorded mileage: 70,000


MOT TEST: 30 December 2013 15:26:56 PASSED
MOT TEST: 30 December 2013 15:26:56 PASSED

This test (157274963358) was completed on the 30 December 2013 15:26:56 and PASSED the requirements for a valid MOT with 0 comments.

This test (157274963358) was completed on the 30 December 2013 15:26:56 and PASSED the requirements for a valid MOT with 0 comments.

Recorded mileage: 69,981

Recorded mileage: 69,981


MOT TEST: 01 October 2012 14:49:17 PASSED
MOT TEST: 01 October 2012 14:49:17 PASSED

This test (898135572291) was completed on the 01 October 2012 14:49:17 and PASSED the requirements for a valid MOT with 0 comments.

This test (898135572291) was completed on the 01 October 2012 14:49:17 and PASSED the requirements for a valid MOT with 0 comments.

Recorded mileage: 69,869

Recorded mileage: 69,869


MOT TEST: 05 July 2011 16:28:37 PASSED
MOT TEST: 05 July 2011 16:28:37 PASSED

This test (706346081135) was completed on the 05 July 2011 16:28:37 and PASSED the requirements for a valid MOT with 0 comments.

This test (706346081135) was completed on the 05 July 2011 16:28:37 and PASSED the requirements for a valid MOT with 0 comments.

Recorded mileage: 69,456

Recorded mileage: 69,456


MOT TEST: 01 March 2011 17:35:20 PASSED
MOT TEST: 01 March 2011 17:35:20 PASSED

This test (698560261029) was completed on the 01 March 2011 17:35:20 and PASSED the requirements for a valid MOT with 0 comments.

This test (698560261029) was completed on the 01 March 2011 17:35:20 and PASSED the requirements for a valid MOT with 0 comments.

Recorded mileage: 694,055

Recorded mileage: 694,055


MOT TEST: 28 February 2011 13:54:14 FAILED
MOT TEST: 28 February 2011 13:54:14 FAILED

This test (268439151038) was completed on the 28 February 2011 13:54:14 and FAILED the requirements for a valid MOT with 5 comments.

This test (268439151038) was completed on the 28 February 2011 13:54:14 and FAILED the requirements for a valid MOT with 5 comments.

Recorded mileage: 69,405

Recorded mileage: 69,405


FAIL


MOT TEST: 11 January 2010 15:36:11 PASSED
MOT TEST: 11 January 2010 15:36:11 PASSED

This test (821581010048) was completed on the 11 January 2010 15:36:11 and PASSED the requirements for a valid MOT with 0 comments.

This test (821581010048) was completed on the 11 January 2010 15:36:11 and PASSED the requirements for a valid MOT with 0 comments.

Recorded mileage: 68,947

Recorded mileage: 68,947


MOT TEST: 02 July 2008 13:59:07 PASSED
MOT TEST: 02 July 2008 13:59:07 PASSED

This test (322684388196) was completed on the 02 July 2008 13:59:07 and PASSED the requirements for a valid MOT with 0 comments.

This test (322684388196) was completed on the 02 July 2008 13:59:07 and PASSED the requirements for a valid MOT with 0 comments.

Recorded mileage: 68,892

Recorded mileage: 68,892


MOT TEST: 04 June 2007 16:03:54 PASSED
MOT TEST: 04 June 2007 16:03:54 PASSED

This test (352825457102) was completed on the 04 June 2007 16:03:54 and PASSED the requirements for a valid MOT with 0 comments.

This test (352825457102) was completed on the 04 June 2007 16:03:54 and PASSED the requirements for a valid MOT with 0 comments.

Recorded mileage: 68,745

Recorded mileage: 68,745


MOT TEST: 04 June 2007 15:17:23 FAILED
MOT TEST: 04 June 2007 15:17:23 FAILED

This test (992675157119) was completed on the 04 June 2007 15:17:23 and FAILED the requirements for a valid MOT with 5 comments.

This test (992675157119) was completed on the 04 June 2007 15:17:23 and FAILED the requirements for a valid MOT with 5 comments.

Recorded mileage: 68,745

Recorded mileage: 68,745


FAIL


MOT TEST: 27 March 2006 16:43:02 PASSED
MOT TEST: 27 March 2006 16:43:02 PASSED

This test (260226186050) was completed on the 27 March 2006 16:43:02 and PASSED the requirements for a valid MOT with 0 comments.

This test (260226186050) was completed on the 27 March 2006 16:43:02 and PASSED the requirements for a valid MOT with 0 comments.

Recorded mileage: 68,694

Recorded mileage: 68,694