769 1CR


7691CR is registered to a Blue 1960, Morris Minor 1000 with a Petrol engine. It Failed its most recent MOT Test on the 21 June 2017

18 unique faults (21 Total) reported in its MOT History (12 Tests).

3 common/recurring faults, the most frequent (2 times) is: Offside Semaphore indicator arm does not extend smoothly (1.4.C.1a).

75% (9) MOT Pass Rate and a 25% (3) MOT Failure Rate.

48,230 recorded miles.

769 1CR


7691CR is registered to a Blue 1960, Morris Minor 1000 with a Petrol engine. It Failed its most recent MOT Test on the 21 June 2017

18 unique faults (21 Total) reported in its MOT History (12 Tests).

3 common/recurring faults, the most frequent (2 times) is: Offside Semaphore indicator arm does not extend smoothly (1.4.C.1a).

75% (9) MOT Pass Rate and a 25% (3) MOT Failure Rate.

48,230 recorded miles.

MOT PASS/Failure rate for 769 1CR

all MOT test results for 769 1CR represented as a percentage
MOT PASS/Failure rate for 769 1CR
all MOT test results for 769 1CR represented as a percentage

PERCENTAGE OF VEHICLE FAULTS WITH 769 1CR

ALL REPORTED FAULTS, DISPLAYED BY PERCENTAGE OF OCCURRENCE DURING ALL MOT TESTS
PERCENTAGE OF VEHICLE FAULTS WITH 769 1CR
ALL REPORTED FAULTS, DISPLAYED BY PERCENTAGE OF OCCURRENCE DURING ALL MOT TESTS
FAIL

USER ENTERED

769 1CR annual Faults by type

ALL REPORTED FAULTS, DISPLAYED over time and categorised by type
769 1CR annual Faults by type
ALL REPORTED FAULTS, DISPLAYED over time and categorised by type

RECURRING FAULTS WITH 769 1CR

FAULTS THAT HAVE OCCURED MORE THAN ONCE DURING 769 1CR's MOT HISTORY
RECURRING FAULTS WITH 769 1CR
FAULTS THAT HAVE OCCURED MORE THAN ONCE DURING 769 1CR's MOT HISTORY
Fault Fault Test Date Test Date/Time Reference MOT Test Reference
2 Offside semaphore indicator arm does not extend smoothly (1.4.c.1a) Offside semaphore indicator arm does not extend smoothly (1.4.c.1a) 08 June 2017 [13:59] 08/06/2017 12 December 2008 [13:12] 12/12/2008 826637762054 826637762054 754727548393 754727548393
2 Windscreen washer provides insufficient washer liquid (8.2.3) Windscreen washer provides insufficient washer liquid (8.2.3) 08 June 2017 [13:59] 08/06/2017 09 February 2011 [17:48] 09/02/2011 826637762054 826637762054 175390741029 175390741029
2 Parking brake: efficiency below requirements (3.7.b.7) Parking brake: efficiency below requirements (3.7.b.7) 08 June 2017 [13:59] 08/06/2017 09 February 2011 [17:48] 09/02/2011 826637762054 826637762054 175390741029 175390741029

ALL 769 1CR Failure Faults [16]

ALL Failure faults, ORDERED by OCCURRENCE DURING 769 1CR's MOT HISTORY
ALL 769 1CR Failure Faults [16]
ALL Failure faults, ORDERED by OCCURRENCE DURING 769 1CR's MOT HISTORY
Fail Faults | source www.vehiclestats.co.uk
Fault Fault Test Date Test Date/Time Reference MOT Test Reference
2 Offside semaphore indicator arm does not extend smoothly (1.4.c.1a) Offside semaphore indicator arm does not extend smoothly (1.4.c.1a) 08 June 2017 [13:59] 08/06/2017 12 December 2008 [13:12] 12/12/2008 826637762054 826637762054 754727548393 754727548393
2 Windscreen washer provides insufficient washer liquid (8.2.3) Windscreen washer provides insufficient washer liquid (8.2.3) 08 June 2017 [13:59] 08/06/2017 09 February 2011 [17:48] 09/02/2011 826637762054 826637762054 175390741029 175390741029
2 Parking brake: efficiency below requirements (3.7.b.7) Parking brake: efficiency below requirements (3.7.b.7) 08 June 2017 [13:59] 08/06/2017 09 February 2011 [17:48] 09/02/2011 826637762054 826637762054 175390741029 175390741029
1 Nearside front position lamp(s) not working (1.1.a.3b) Nearside front position lamp(s) not working (1.1.a.3b) 08 June 2017 [13:59] 08/06/2017 826637762054 826637762054
1 Nearside semaphore indicator arm does not extend smoothly (1.4.c.1a) Nearside semaphore indicator arm does not extend smoothly (1.4.c.1a) 08 June 2017 [13:59] 08/06/2017 826637762054 826637762054
1 Offside rear suspension spring mounting prescribed area is excessively corroded floor (2.4.a.3) Offside rear suspension spring mounting prescribed area is excessively corroded floor (2.4.a.3) 08 June 2017 [13:59] 08/06/2017 826637762054 826637762054
1 Nearside rear suspension spring mounting prescribed area is excessively corroded above rear mounting (2.4.a.3) Nearside rear suspension spring mounting prescribed area is excessively corroded above rear mounting (2.4.a.3) 08 June 2017 [13:59] 08/06/2017 826637762054 826637762054
1 Rear brakes imbalanced across an axle axle 2 (3.7.b.5b) Rear brakes imbalanced across an axle axle 2 (3.7.b.5b) 08 June 2017 [13:59] 08/06/2017 826637762054 826637762054
1 Nearside front suspension component mounting prescribed area is excessively corroded (2.4.a.3) Nearside front suspension component mounting prescribed area is excessively corroded (2.4.a.3) 09 February 2011 [17:48] 09/02/2011 175390741029 175390741029
1 Brakes imbalanced across an axle (3.7.b.5b) Brakes imbalanced across an axle (3.7.b.5b) 09 February 2011 [17:48] 09/02/2011 175390741029 175390741029
1 Offside semaphore indicator arm does not retract smoothly (1.4.c.1a) Offside semaphore indicator arm does not retract smoothly (1.4.c.1a) 12 December 2008 [13:12] 12/12/2008 754727548393 754727548393
1 Registration plate lamp not working (1.1.5c) Registration plate lamp not working (1.1.5c) 12 December 2008 [13:12] 12/12/2008 754727548393 754727548393
1 Offside rear suspension spring mounting prescribed area is excessively corroded (2.4.a.3) Offside rear suspension spring mounting prescribed area is excessively corroded (2.4.a.3) 12 December 2008 [13:12] 12/12/2008 754727548393 754727548393

ALL 769 1CR User Entered Faults [5]

ALL User Entered faults, ORDERED by OCCURRENCE DURING 769 1CR's MOT HISTORY
ALL 769 1CR User Entered Faults [5]
ALL User Entered faults, ORDERED by OCCURRENCE DURING 769 1CR's MOT HISTORY
User Entered Faults | source www.vehiclestats.co.uk
Fault Fault Test Date Test Date/Time Reference MOT Test Reference
1 Fuel pipe has signs of rust Fuel pipe has signs of rust 22 February 2011 [14:45] 22/02/2011 588963951097 588963951097
1 Near side wiper arm spring weak Near side wiper arm spring weak 22 February 2011 [14:45] 22/02/2011 588963951097 588963951097
1 Slight play in near side front suspension Slight play in near side front suspension 22 February 2011 [14:45] 22/02/2011 588963951097 588963951097
1 Offside indicator arm needs slight attention Offside indicator arm needs slight attention 02 August 2007 [11:39] 02/08/2007 303364117240 303364117240
1 Slight play in nearside top joint and bush Slight play in nearside top joint and bush 02 August 2007 [11:39] 02/08/2007 303364117240 303364117240

MOT TEST: 21 June 2017 14:12:33 PASSED
MOT TEST: 21 June 2017 14:12:33 PASSED

This test (510598917526) was completed on the 21 June 2017 14:12:33 and PASSED the requirements for a valid MOT with 0 comments.

This test (510598917526) was completed on the 21 June 2017 14:12:33 and PASSED the requirements for a valid MOT with 0 comments.

Recorded mileage: 48,230

Recorded mileage: 48,230


MOT TEST: 08 June 2017 13:59:58 FAILED
MOT TEST: 08 June 2017 13:59:58 FAILED

This test (826637762054) was completed on the 08 June 2017 13:59:58 and FAILED the requirements for a valid MOT with 8 comments.

This test (826637762054) was completed on the 08 June 2017 13:59:58 and FAILED the requirements for a valid MOT with 8 comments.

Recorded mileage: 48,207

Recorded mileage: 48,207


FAIL


MOT TEST: 13 June 2016 13:13:54 PASSED
MOT TEST: 13 June 2016 13:13:54 PASSED

This test (368990818626) was completed on the 13 June 2016 13:13:54 and PASSED the requirements for a valid MOT with 0 comments.

This test (368990818626) was completed on the 13 June 2016 13:13:54 and PASSED the requirements for a valid MOT with 0 comments.

Recorded mileage: 47,589

Recorded mileage: 47,589


MOT TEST: 19 May 2015 11:49:05 PASSED
MOT TEST: 19 May 2015 11:49:05 PASSED

This test (306289035134) was completed on the 19 May 2015 11:49:05 and PASSED the requirements for a valid MOT with 0 comments.

This test (306289035134) was completed on the 19 May 2015 11:49:05 and PASSED the requirements for a valid MOT with 0 comments.

Recorded mileage: 47,386

Recorded mileage: 47,386


MOT TEST: 14 May 2014 11:31:54 PASSED
MOT TEST: 14 May 2014 11:31:54 PASSED

This test (279364734177) was completed on the 14 May 2014 11:31:54 and PASSED the requirements for a valid MOT with 0 comments.

This test (279364734177) was completed on the 14 May 2014 11:31:54 and PASSED the requirements for a valid MOT with 0 comments.

Recorded mileage: 46,917

Recorded mileage: 46,917


MOT TEST: 21 May 2013 14:12:39 PASSED
MOT TEST: 21 May 2013 14:12:39 PASSED

This test (195451243167) was completed on the 21 May 2013 14:12:39 and PASSED the requirements for a valid MOT with 0 comments.

This test (195451243167) was completed on the 21 May 2013 14:12:39 and PASSED the requirements for a valid MOT with 0 comments.

Recorded mileage: 46,110

Recorded mileage: 46,110


MOT TEST: 22 February 2011 14:45:52 PASSED
MOT TEST: 22 February 2011 14:45:52 PASSED

This test (588963951097) was completed on the 22 February 2011 14:45:52 and PASSED the requirements for a valid MOT with 3 comments.

This test (588963951097) was completed on the 22 February 2011 14:45:52 and PASSED the requirements for a valid MOT with 3 comments.

Recorded mileage: 45,325

Recorded mileage: 45,325


USER ENTERED


MOT TEST: 09 February 2011 17:48:04 FAILED
MOT TEST: 09 February 2011 17:48:04 FAILED

This test (175390741029) was completed on the 09 February 2011 17:48:04 and FAILED the requirements for a valid MOT with 4 comments.

This test (175390741029) was completed on the 09 February 2011 17:48:04 and FAILED the requirements for a valid MOT with 4 comments.

Recorded mileage: 45,325

Recorded mileage: 45,325


FAIL


MOT TEST: 17 December 2008 16:43:56 PASSED
MOT TEST: 17 December 2008 16:43:56 PASSED

This test (563592658393) was completed on the 17 December 2008 16:43:56 and PASSED the requirements for a valid MOT with 0 comments.

This test (563592658393) was completed on the 17 December 2008 16:43:56 and PASSED the requirements for a valid MOT with 0 comments.

Recorded mileage: 42,155

Recorded mileage: 42,155


MOT TEST: 12 December 2008 13:12:06 FAILED
MOT TEST: 12 December 2008 13:12:06 FAILED

This test (754727548393) was completed on the 12 December 2008 13:12:06 and FAILED the requirements for a valid MOT with 4 comments.

This test (754727548393) was completed on the 12 December 2008 13:12:06 and FAILED the requirements for a valid MOT with 4 comments.

Recorded mileage: 42,124

Recorded mileage: 42,124


FAIL


MOT TEST: 02 August 2007 11:39:00 PASSED
MOT TEST: 02 August 2007 11:39:00 PASSED

This test (303364117240) was completed on the 02 August 2007 11:39:00 and PASSED the requirements for a valid MOT with 2 comments.

This test (303364117240) was completed on the 02 August 2007 11:39:00 and PASSED the requirements for a valid MOT with 2 comments.

Recorded mileage: 40,994

Recorded mileage: 40,994


USER ENTERED


MOT TEST: 28 June 2006 09:31:59 PASSED
MOT TEST: 28 June 2006 09:31:59 PASSED

This test (262789976404) was completed on the 28 June 2006 09:31:59 and PASSED the requirements for a valid MOT with 0 comments.

This test (262789976404) was completed on the 28 June 2006 09:31:59 and PASSED the requirements for a valid MOT with 0 comments.

Recorded mileage: 38,916

Recorded mileage: 38,916