769 8UK


7698UK is registered to a Brown 1963, Morris Minor 1000 with a Petrol engine. It Failed its most recent MOT Test on the 01 September 2010

20 unique faults (20 Total) reported in its MOT History (4 Tests).

0 common/recurring faults.

50% (2) MOT Pass Rate and a 50% (2) MOT Failure Rate.

87,196 recorded miles.

769 8UK


7698UK is registered to a Brown 1963, Morris Minor 1000 with a Petrol engine. It Failed its most recent MOT Test on the 01 September 2010

20 unique faults (20 Total) reported in its MOT History (4 Tests).

0 common/recurring faults.

50% (2) MOT Pass Rate and a 50% (2) MOT Failure Rate.

87,196 recorded miles.

MOT PASS/Failure rate for 769 8UK

all MOT test results for 769 8UK represented as a percentage
MOT PASS/Failure rate for 769 8UK
all MOT test results for 769 8UK represented as a percentage

PERCENTAGE OF VEHICLE FAULTS WITH 769 8UK

ALL REPORTED FAULTS, DISPLAYED BY PERCENTAGE OF OCCURRENCE DURING ALL MOT TESTS
PERCENTAGE OF VEHICLE FAULTS WITH 769 8UK
ALL REPORTED FAULTS, DISPLAYED BY PERCENTAGE OF OCCURRENCE DURING ALL MOT TESTS
FAIL

USER ENTERED

769 8UK annual Faults by type

ALL REPORTED FAULTS, DISPLAYED over time and categorised by type
769 8UK annual Faults by type
ALL REPORTED FAULTS, DISPLAYED over time and categorised by type

ALL 769 8UK Failure Faults [17]

ALL Failure faults, ORDERED by OCCURRENCE DURING 769 8UK's MOT HISTORY
ALL 769 8UK Failure Faults [17]
ALL Failure faults, ORDERED by OCCURRENCE DURING 769 8UK's MOT HISTORY
Fail Faults | source www.vehiclestats.co.uk
Fault Fault Test Date Test Date/Time Reference MOT Test Reference
1 Windscreen washer provides insufficient washer liquid (8.2.3) Windscreen washer provides insufficient washer liquid (8.2.3) 12 February 2007 [14:40] 12/02/2007 142373547440 142373547440
1 Fuel cap/sealing device does not fasten securely maintaining the sealing arrangement (7.2.4b) Fuel cap/sealing device does not fasten securely maintaining the sealing arrangement (7.2.4b) 12 February 2007 [14:40] 12/02/2007 142373547440 142373547440
1 Horn not working (1.6.2a) Horn not working (1.6.2a) 12 February 2007 [14:40] 12/02/2007 142373547440 142373547440
1 Nearside rear vehicle structure has excessive corrosion, seriously affecting its strength within 30cm of the body mountings (6.1.b.2) Nearside rear vehicle structure has excessive corrosion, seriously affecting its strength within 30cm of the body mountings (6.1.b.2) 12 February 2007 [14:40] 12/02/2007 142373547440 142373547440
1 Offside rear vehicle structure has excessive corrosion, seriously affecting its strength within 30cm of the body mountings (6.1.b.2) Offside rear vehicle structure has excessive corrosion, seriously affecting its strength within 30cm of the body mountings (6.1.b.2) 12 February 2007 [14:40] 12/02/2007 142373547440 142373547440
1 Nearside rear wheel bearing rough when rotated (2.6.1) Nearside rear wheel bearing rough when rotated (2.6.1) 12 February 2007 [14:40] 12/02/2007 142373547440 142373547440
1 Offside rear wheel bearing has excessive play (2.6.2) Offside rear wheel bearing has excessive play (2.6.2) 12 February 2007 [14:40] 12/02/2007 142373547440 142373547440
1 Nearside front wheel bearing has excessive play (2.5.a.3c) Nearside front wheel bearing has excessive play (2.5.a.3c) 12 February 2007 [14:40] 12/02/2007 142373547440 142373547440
1 Offside rear position lamp(s) insecure (1.1.a.3a) Offside rear position lamp(s) insecure (1.1.a.3a) 12 February 2007 [14:40] 12/02/2007 142373547440 142373547440
1 Brake pedal has insufficient reserve movement (3.3.a.5) Brake pedal has insufficient reserve movement (3.3.a.5) 19 December 2005 [17:46] 19/12/2005 923533855377 923533855377
1 Offside rear rear brake binding (3.7.b.1) Offside rear rear brake binding (3.7.b.1) 19 December 2005 [17:46] 19/12/2005 923533855377 923533855377
1 Rear brake pipe inadequately clipped (3.6.b.1) Rear brake pipe inadequately clipped (3.6.b.1) 19 December 2005 [17:46] 19/12/2005 923533855377 923533855377
1 Rear registration plate lamp not working (1.1.5c) Rear registration plate lamp not working (1.1.5c) 19 December 2005 [17:46] 19/12/2005 923533855377 923533855377
1 Nearside rear suspension spring mounting prescribed area is excessively corroded (2.4.a.3) Nearside rear suspension spring mounting prescribed area is excessively corroded (2.4.a.3) 19 December 2005 [17:46] 19/12/2005 923533855377 923533855377
1 Offside rear suspension spring mounting prescribed area is excessively corroded (2.4.a.3) Offside rear suspension spring mounting prescribed area is excessively corroded (2.4.a.3) 19 December 2005 [17:46] 19/12/2005 923533855377 923533855377
1 Rear brake application uneven (3.7.b.2) Rear brake application uneven (3.7.b.2) 19 December 2005 [17:46] 19/12/2005 923533855377 923533855377
1 Parking brake: efficiency below requirements (3.7.b.7) Parking brake: efficiency below requirements (3.7.b.7) 19 December 2005 [17:46] 19/12/2005 923533855377 923533855377

ALL 769 8UK User Entered Faults [3]

ALL User Entered faults, ORDERED by OCCURRENCE DURING 769 8UK's MOT HISTORY
ALL 769 8UK User Entered Faults [3]
ALL User Entered faults, ORDERED by OCCURRENCE DURING 769 8UK's MOT HISTORY
User Entered Faults | source www.vehiclestats.co.uk
Fault Fault Test Date Test Date/Time Reference MOT Test Reference
1 O/s//r tyre sidewall cracking O/s//r tyre sidewall cracking 01 September 2010 [10:50] 01/09/2010 581704340213 581704340213
1 General condition of body. General condition of body. 09 January 2006 [12:37] 09/01/2006 564849906045 564849906045
1 Condition of offside rear inner wheel arch ,condition of nearside front wheel bearing , condition of nearside front floor . Condition of offside rear inner wheel arch ,condition of nearside front wheel bearing , condition of nearside front floor . 19 December 2005 [17:46] 19/12/2005 923533855377 923533855377

MOT TEST: 01 September 2010 10:50:02 PASSED
MOT TEST: 01 September 2010 10:50:02 PASSED

This test (581704340213) was completed on the 01 September 2010 10:50:02 and PASSED the requirements for a valid MOT with 1 comments.

This test (581704340213) was completed on the 01 September 2010 10:50:02 and PASSED the requirements for a valid MOT with 1 comments.

Recorded mileage: 87,196

Recorded mileage: 87,196


USER ENTERED


MOT TEST: 12 February 2007 14:40:28 FAILED
MOT TEST: 12 February 2007 14:40:28 FAILED

This test (142373547440) was completed on the 12 February 2007 14:40:28 and FAILED the requirements for a valid MOT with 9 comments.

This test (142373547440) was completed on the 12 February 2007 14:40:28 and FAILED the requirements for a valid MOT with 9 comments.

Recorded mileage: 85,552

Recorded mileage: 85,552


FAIL


MOT TEST: 09 January 2006 12:37:26 PASSED
MOT TEST: 09 January 2006 12:37:26 PASSED

This test (564849906045) was completed on the 09 January 2006 12:37:26 and PASSED the requirements for a valid MOT with 1 comments.

This test (564849906045) was completed on the 09 January 2006 12:37:26 and PASSED the requirements for a valid MOT with 1 comments.

Recorded mileage: 85,554

Recorded mileage: 85,554


USER ENTERED


MOT TEST: 19 December 2005 17:46:00 FAILED
MOT TEST: 19 December 2005 17:46:00 FAILED

This test (923533855377) was completed on the 19 December 2005 17:46:00 and FAILED the requirements for a valid MOT with 9 comments.

This test (923533855377) was completed on the 19 December 2005 17:46:00 and FAILED the requirements for a valid MOT with 9 comments.

Recorded mileage: 85,552

Recorded mileage: 85,552


FAIL

USER ENTERED