769 AHU


769AHU is registered to a Grey 1957, Morris Minor 1000 with a Petrol engine. It Failed its most recent MOT Test on the 23 May 2012

20 unique faults (25 Total) reported in its MOT History (12 Tests).

3 common/recurring faults, the most frequent (4 times) is: Parking brake: efficiency below requirements (3.7.B.7).

58% (7) MOT Pass Rate and a 42% (5) MOT Failure Rate.

28,929 recorded miles.

769 AHU


769AHU is registered to a Grey 1957, Morris Minor 1000 with a Petrol engine. It Failed its most recent MOT Test on the 23 May 2012

20 unique faults (25 Total) reported in its MOT History (12 Tests).

3 common/recurring faults, the most frequent (4 times) is: Parking brake: efficiency below requirements (3.7.B.7).

58% (7) MOT Pass Rate and a 42% (5) MOT Failure Rate.

28,929 recorded miles.

MOT PASS/Failure rate for 769 AHU

all MOT test results for 769 AHU represented as a percentage
MOT PASS/Failure rate for 769 AHU
all MOT test results for 769 AHU represented as a percentage

PERCENTAGE OF VEHICLE FAULTS WITH 769 AHU

ALL REPORTED FAULTS, DISPLAYED BY PERCENTAGE OF OCCURRENCE DURING ALL MOT TESTS
PERCENTAGE OF VEHICLE FAULTS WITH 769 AHU
ALL REPORTED FAULTS, DISPLAYED BY PERCENTAGE OF OCCURRENCE DURING ALL MOT TESTS
ADVISORY

FAIL

USER ENTERED

769 AHU annual Faults by type

ALL REPORTED FAULTS, DISPLAYED over time and categorised by type
769 AHU annual Faults by type
ALL REPORTED FAULTS, DISPLAYED over time and categorised by type

RECURRING FAULTS WITH 769 AHU

FAULTS THAT HAVE OCCURED MORE THAN ONCE DURING 769 AHU's MOT HISTORY
RECURRING FAULTS WITH 769 AHU
FAULTS THAT HAVE OCCURED MORE THAN ONCE DURING 769 AHU's MOT HISTORY
Fault Fault Test Date Test Date/Time Reference MOT Test Reference
4 Parking brake: efficiency below requirements (3.7.b.7) Parking brake: efficiency below requirements (3.7.b.7) 06 May 2009 [10:02] 06/05/2009 21 May 2008 [09:34] 21/05/2008 21 May 2007 [12:51] 21/05/2007 15 May 2006 [13:11] 15/05/2006 550316029115 550316029115 521092648155 521092648155 124711247168 124711247168 414685936114 414685936114
2 Offside rear brake recording little or no effort (3.7.b.5a) Offside rear brake recording little or no effort (3.7.b.5a) 21 May 2007 [12:51] 21/05/2007 15 May 2006 [13:11] 15/05/2006 124711247168 124711247168 414685936114 414685936114
2 Offside rear parking brake recording little or no effort (3.7.b.6a) Offside rear parking brake recording little or no effort (3.7.b.6a) 21 May 2007 [12:51] 21/05/2007 15 May 2006 [13:11] 15/05/2006 124711247168 124711247168 414685936114 414685936114

ALL 769 AHU ADVISORIES [2]

ALL ADVISORIES, ORDERED by OCCURRENCE DURING 769 AHU's MOT HISTORY
ALL 769 AHU ADVISORIES [2]
ALL ADVISORIES, ORDERED by OCCURRENCE DURING 769 AHU's MOT HISTORY
Fail Faults | source www.vehiclestats.co.uk
Fault Fault Test Date Test Date/Time Reference MOT Test Reference
1 Brakes imbalanced requirements only just met. It would appear that the braking system requires adjustment or repair. (3.7.b.5b) Brakes imbalanced requirements only just met. It would appear that the braking system requires adjustment or repair. (3.7.b.5b) 16 May 2012 [16:16] 16/05/2012 216517832445 216517832445
1 Service brake: service brake efficiency only just met. It would appear that the braking system requires adjustment or repair. (3.7.b.7) Service brake: service brake efficiency only just met. It would appear that the braking system requires adjustment or repair. (3.7.b.7) 21 May 2007 [12:51] 21/05/2007 124711247168 124711247168

ALL 769 AHU Failure Faults [21]

ALL Failure faults, ORDERED by OCCURRENCE DURING 769 AHU's MOT HISTORY
ALL 769 AHU Failure Faults [21]
ALL Failure faults, ORDERED by OCCURRENCE DURING 769 AHU's MOT HISTORY
Fail Faults | source www.vehiclestats.co.uk
Fault Fault Test Date Test Date/Time Reference MOT Test Reference
4 Parking brake: efficiency below requirements (3.7.b.7) Parking brake: efficiency below requirements (3.7.b.7) 06 May 2009 [10:02] 06/05/2009 21 May 2008 [09:34] 21/05/2008 21 May 2007 [12:51] 21/05/2007 15 May 2006 [13:11] 15/05/2006 550316029115 550316029115 521092648155 521092648155 124711247168 124711247168 414685936114 414685936114
2 Offside rear brake recording little or no effort (3.7.b.5a) Offside rear brake recording little or no effort (3.7.b.5a) 21 May 2007 [12:51] 21/05/2007 15 May 2006 [13:11] 15/05/2006 124711247168 124711247168 414685936114 414685936114
2 Offside rear parking brake recording little or no effort (3.7.b.6a) Offside rear parking brake recording little or no effort (3.7.b.6a) 21 May 2007 [12:51] 21/05/2007 15 May 2006 [13:11] 15/05/2006 124711247168 124711247168 414685936114 414685936114
1 Offside windscreen washer provides insufficient washer liquid (8.2.3) Offside windscreen washer provides insufficient washer liquid (8.2.3) 16 May 2012 [16:16] 16/05/2012 216517832445 216517832445
1 Nearside front direction indicator not working (1.4.a.2c) Nearside front direction indicator not working (1.4.a.2c) 16 May 2012 [16:16] 16/05/2012 216517832445 216517832445
1 Nearside headlamp aim too high (1.8) Nearside headlamp aim too high (1.8) 16 May 2012 [16:16] 16/05/2012 216517832445 216517832445
1 Offside headlamp aim too low (1.8) Offside headlamp aim too low (1.8) 16 May 2012 [16:16] 16/05/2012 216517832445 216517832445
1 Offside rear position lamp(s) not working (1.1.a.3b) Offside rear position lamp(s) not working (1.1.a.3b) 16 May 2012 [16:16] 16/05/2012 216517832445 216517832445
1 Offside stop lamp not working (1.2.1b) Offside stop lamp not working (1.2.1b) 16 May 2012 [16:16] 16/05/2012 216517832445 216517832445
1 Offside front mechanical brake component has restricted free movement (3.5.1k) Offside front mechanical brake component has restricted free movement (3.5.1k) 16 May 2012 [16:16] 16/05/2012 216517832445 216517832445
1 Offside lower axle swivel joint has excessive play in a swivel pin (2.5.a.3b) Offside lower axle swivel joint has excessive play in a swivel pin (2.5.a.3b) 16 May 2012 [16:16] 16/05/2012 216517832445 216517832445
1 Registration plate lamp not working (1.1.5c) Registration plate lamp not working (1.1.5c) 06 May 2009 [10:02] 06/05/2009 550316029115 550316029115
1 Front fuel system component leaking (7.2.3) Front fuel system component leaking (7.2.3) 06 May 2009 [10:02] 06/05/2009 550316029115 550316029115
1 Nearside rear brake recording little or no effort (3.7.b.5a) Nearside rear brake recording little or no effort (3.7.b.5a) 21 May 2008 [09:34] 21/05/2008 521092648155 521092648155
1 Offside front direction indicator not working (1.4.a.2c) Offside front direction indicator not working (1.4.a.2c) 21 May 2007 [12:51] 21/05/2007 124711247168 124711247168
1 Offside rear brake binding (3.7.b.1) Offside rear brake binding (3.7.b.1) 21 May 2007 [12:51] 21/05/2007 124711247168 124711247168

ALL 769 AHU User Entered Faults [2]

ALL User Entered faults, ORDERED by OCCURRENCE DURING 769 AHU's MOT HISTORY
ALL 769 AHU User Entered Faults [2]
ALL User Entered faults, ORDERED by OCCURRENCE DURING 769 AHU's MOT HISTORY
Fail Faults | source www.vehiclestats.co.uk
Fault Fault Test Date Test Date/Time Reference MOT Test Reference
1 O/s side repeater not working O/s side repeater not working 16 May 2012 [16:16] 16/05/2012 216517832445 216517832445
1 Osr ,nsf& osf tyres perishing Osr ,nsf& osf tyres perishing 19 May 2011 [15:20] 19/05/2011 236329231407 236329231407

MOT TEST: 23 May 2012 12:14:23 PASSED
MOT TEST: 23 May 2012 12:14:23 PASSED

This test (188874142182) was completed on the 23 May 2012 12:14:23 and PASSED the requirements for a valid MOT with 0 comments.

This test (188874142182) was completed on the 23 May 2012 12:14:23 and PASSED the requirements for a valid MOT with 0 comments.

Recorded mileage: 28,929

Recorded mileage: 28,929


MOT TEST: 16 May 2012 16:16:33 FAILED
MOT TEST: 16 May 2012 16:16:33 FAILED

This test (216517832445) was completed on the 16 May 2012 16:16:33 and FAILED the requirements for a valid MOT with 10 comments.

This test (216517832445) was completed on the 16 May 2012 16:16:33 and FAILED the requirements for a valid MOT with 10 comments.

Recorded mileage: 28,929

Recorded mileage: 28,929


ADVISORY

FAIL

USER ENTERED


MOT TEST: 19 May 2011 15:20:08 PASSED
MOT TEST: 19 May 2011 15:20:08 PASSED

This test (236329231407) was completed on the 19 May 2011 15:20:08 and PASSED the requirements for a valid MOT with 1 comments.

This test (236329231407) was completed on the 19 May 2011 15:20:08 and PASSED the requirements for a valid MOT with 1 comments.

Recorded mileage: 28,767

Recorded mileage: 28,767


USER ENTERED


MOT TEST: 20 May 2010 16:35:34 PASSED
MOT TEST: 20 May 2010 16:35:34 PASSED

This test (134220340171) was completed on the 20 May 2010 16:35:34 and PASSED the requirements for a valid MOT with 0 comments.

This test (134220340171) was completed on the 20 May 2010 16:35:34 and PASSED the requirements for a valid MOT with 0 comments.

Recorded mileage: 28,615

Recorded mileage: 28,615


MOT TEST: 13 May 2009 09:08:10 PASSED
MOT TEST: 13 May 2009 09:08:10 PASSED

This test (742603539124) was completed on the 13 May 2009 09:08:10 and PASSED the requirements for a valid MOT with 0 comments.

This test (742603539124) was completed on the 13 May 2009 09:08:10 and PASSED the requirements for a valid MOT with 0 comments.

Recorded mileage: 28,319

Recorded mileage: 28,319


MOT TEST: 06 May 2009 10:02:00 FAILED
MOT TEST: 06 May 2009 10:02:00 FAILED

This test (550316029115) was completed on the 06 May 2009 10:02:00 and FAILED the requirements for a valid MOT with 3 comments.

This test (550316029115) was completed on the 06 May 2009 10:02:00 and FAILED the requirements for a valid MOT with 3 comments.

Recorded mileage: 28,315

Recorded mileage: 28,315


FAIL


MOT TEST: 22 May 2008 17:16:15 PASSED
MOT TEST: 22 May 2008 17:16:15 PASSED

This test (752383548164) was completed on the 22 May 2008 17:16:15 and PASSED the requirements for a valid MOT with 0 comments.

This test (752383548164) was completed on the 22 May 2008 17:16:15 and PASSED the requirements for a valid MOT with 0 comments.

Recorded mileage: 27,920

Recorded mileage: 27,920


MOT TEST: 21 May 2008 09:34:24 FAILED
MOT TEST: 21 May 2008 09:34:24 FAILED

This test (521092648155) was completed on the 21 May 2008 09:34:24 and FAILED the requirements for a valid MOT with 2 comments.

This test (521092648155) was completed on the 21 May 2008 09:34:24 and FAILED the requirements for a valid MOT with 2 comments.

Recorded mileage: 27,920

Recorded mileage: 27,920


FAIL


MOT TEST: 21 May 2007 16:51:23 PASSED
MOT TEST: 21 May 2007 16:51:23 PASSED

This test (672201747163) was completed on the 21 May 2007 16:51:23 and PASSED the requirements for a valid MOT with 0 comments.

This test (672201747163) was completed on the 21 May 2007 16:51:23 and PASSED the requirements for a valid MOT with 0 comments.

Recorded mileage: 27,390

Recorded mileage: 27,390


MOT TEST: 21 May 2007 12:51:45 FAILED
MOT TEST: 21 May 2007 12:51:45 FAILED

This test (124711247168) was completed on the 21 May 2007 12:51:45 and FAILED the requirements for a valid MOT with 6 comments.

This test (124711247168) was completed on the 21 May 2007 12:51:45 and FAILED the requirements for a valid MOT with 6 comments.

Recorded mileage: 27,390

Recorded mileage: 27,390


ADVISORY

FAIL


MOT TEST: 15 May 2006 14:42:55 PASSED
MOT TEST: 15 May 2006 14:42:55 PASSED

This test (323995536160) was completed on the 15 May 2006 14:42:55 and PASSED the requirements for a valid MOT with 0 comments.

This test (323995536160) was completed on the 15 May 2006 14:42:55 and PASSED the requirements for a valid MOT with 0 comments.

Recorded mileage: 26,925

Recorded mileage: 26,925


MOT TEST: 15 May 2006 13:11:52 FAILED
MOT TEST: 15 May 2006 13:11:52 FAILED

This test (414685936114) was completed on the 15 May 2006 13:11:52 and FAILED the requirements for a valid MOT with 3 comments.

This test (414685936114) was completed on the 15 May 2006 13:11:52 and FAILED the requirements for a valid MOT with 3 comments.

Recorded mileage: 26,925

Recorded mileage: 26,925


FAIL