772 YUH


772YUH is registered to a White 1959, Morris Minor with a Petrol engine. It Failed its most recent MOT Test on the 16 April 2013

8 unique faults (10 Total) reported in its MOT History (5 Tests).

2 common/recurring faults, the most frequent (2 times) is: Nearside Front suspension has slight play in a lower suspension ball joint (2.5.B.1a).

60% (3) MOT Pass Rate and a 40% (2) MOT Failure Rate.

85,475 recorded miles.

772 YUH


772YUH is registered to a White 1959, Morris Minor with a Petrol engine. It Failed its most recent MOT Test on the 16 April 2013

8 unique faults (10 Total) reported in its MOT History (5 Tests).

2 common/recurring faults, the most frequent (2 times) is: Nearside Front suspension has slight play in a lower suspension ball joint (2.5.B.1a).

60% (3) MOT Pass Rate and a 40% (2) MOT Failure Rate.

85,475 recorded miles.

MOT PASS/Failure rate for 772 YUH

all MOT test results for 772 YUH represented as a percentage
MOT PASS/Failure rate for 772 YUH
all MOT test results for 772 YUH represented as a percentage

PERCENTAGE OF VEHICLE FAULTS WITH 772 YUH

ALL REPORTED FAULTS, DISPLAYED BY PERCENTAGE OF OCCURRENCE DURING ALL MOT TESTS
PERCENTAGE OF VEHICLE FAULTS WITH 772 YUH
ALL REPORTED FAULTS, DISPLAYED BY PERCENTAGE OF OCCURRENCE DURING ALL MOT TESTS
ADVISORY

FAIL

USER ENTERED

772 YUH annual Faults by type

ALL REPORTED FAULTS, DISPLAYED over time and categorised by type
772 YUH annual Faults by type
ALL REPORTED FAULTS, DISPLAYED over time and categorised by type

RECURRING FAULTS WITH 772 YUH

FAULTS THAT HAVE OCCURED MORE THAN ONCE DURING 772 YUH's MOT HISTORY
RECURRING FAULTS WITH 772 YUH
FAULTS THAT HAVE OCCURED MORE THAN ONCE DURING 772 YUH's MOT HISTORY
Fault Fault Test Date Test Date/Time Reference MOT Test Reference
2 Nearside front suspension has slight play in a lower suspension ball joint (2.5.b.1a) Nearside front suspension has slight play in a lower suspension ball joint (2.5.b.1a) 27 March 2012 [15:00] 27/03/2012 26 March 2012 [15:03] 26/03/2012 286587582069 286587582069 488906682049 488906682049
2 Centre exhaust mounting weak Centre exhaust mounting weak 29 March 2011 [12:05] 29/03/2011 28 March 2011 [15:31] 28/03/2011 145868381413 145868381413 799927181074 799927181074

ALL 772 YUH ADVISORIES [2]

ALL ADVISORIES, ORDERED by OCCURRENCE DURING 772 YUH's MOT HISTORY
ALL 772 YUH ADVISORIES [2]
ALL ADVISORIES, ORDERED by OCCURRENCE DURING 772 YUH's MOT HISTORY
Advisory Faults | source www.vehiclestats.co.uk
Fault Fault Test Date Test Date/Time Reference MOT Test Reference
2 Nearside front suspension has slight play in a lower suspension ball joint (2.5.b.1a) Nearside front suspension has slight play in a lower suspension ball joint (2.5.b.1a) 27 March 2012 [15:00] 27/03/2012 26 March 2012 [15:03] 26/03/2012 286587582069 286587582069 488906682049 488906682049

ALL 772 YUH Failure Faults [6]

ALL Failure faults, ORDERED by OCCURRENCE DURING 772 YUH's MOT HISTORY
ALL 772 YUH Failure Faults [6]
ALL Failure faults, ORDERED by OCCURRENCE DURING 772 YUH's MOT HISTORY
Fail Faults | source www.vehiclestats.co.uk
Fault Fault Test Date Test Date/Time Reference MOT Test Reference
1 Nearside rear position lamp(s) not working (1.1.a.3b) Nearside rear position lamp(s) not working (1.1.a.3b) 26 March 2012 [15:03] 26/03/2012 488906682049 488906682049
1 Offside rear position lamp(s) not working (1.1.a.3b) Offside rear position lamp(s) not working (1.1.a.3b) 26 March 2012 [15:03] 26/03/2012 488906682049 488906682049
1 Registration plate lamp not working (1.1.c.1d) Registration plate lamp not working (1.1.c.1d) 26 March 2012 [15:03] 26/03/2012 488906682049 488906682049
1 Nearside headlamp not working on dipped beam (1.7.5a) Nearside headlamp not working on dipped beam (1.7.5a) 26 March 2012 [15:03] 26/03/2012 488906682049 488906682049
1 Offside headlamp not working on dipped beam (1.7.5a) Offside headlamp not working on dipped beam (1.7.5a) 26 March 2012 [15:03] 26/03/2012 488906682049 488906682049
1 Windscreen washer provides insufficient washer liquid (8.2.3) Windscreen washer provides insufficient washer liquid (8.2.3) 28 March 2011 [15:31] 28/03/2011 799927181074 799927181074

ALL 772 YUH User Entered Faults [2]

ALL User Entered faults, ORDERED by OCCURRENCE DURING 772 YUH's MOT HISTORY
ALL 772 YUH User Entered Faults [2]
ALL User Entered faults, ORDERED by OCCURRENCE DURING 772 YUH's MOT HISTORY
User Entered Faults | source www.vehiclestats.co.uk
Fault Fault Test Date Test Date/Time Reference MOT Test Reference
2 Centre exhaust mounting weak Centre exhaust mounting weak 29 March 2011 [12:05] 29/03/2011 28 March 2011 [15:31] 28/03/2011 145868381413 145868381413 799927181074 799927181074

MOT TEST: 16 April 2013 11:36:36 PASSED
MOT TEST: 16 April 2013 11:36:36 PASSED

This test (855696403138) was completed on the 16 April 2013 11:36:36 and PASSED the requirements for a valid MOT with 0 comments.

This test (855696403138) was completed on the 16 April 2013 11:36:36 and PASSED the requirements for a valid MOT with 0 comments.

Recorded mileage: 85,475

Recorded mileage: 85,475


MOT TEST: 27 March 2012 15:00:42 PASSED
MOT TEST: 27 March 2012 15:00:42 PASSED

This test (286587582069) was completed on the 27 March 2012 15:00:42 and PASSED the requirements for a valid MOT with 1 comments.

This test (286587582069) was completed on the 27 March 2012 15:00:42 and PASSED the requirements for a valid MOT with 1 comments.

Recorded mileage: 84,650

Recorded mileage: 84,650


ADVISORY


MOT TEST: 26 March 2012 15:03:57 FAILED
MOT TEST: 26 March 2012 15:03:57 FAILED

This test (488906682049) was completed on the 26 March 2012 15:03:57 and FAILED the requirements for a valid MOT with 6 comments.

This test (488906682049) was completed on the 26 March 2012 15:03:57 and FAILED the requirements for a valid MOT with 6 comments.

Recorded mileage: 84,650

Recorded mileage: 84,650


ADVISORY

FAIL


MOT TEST: 29 March 2011 12:05:29 PASSED
MOT TEST: 29 March 2011 12:05:29 PASSED

This test (145868381413) was completed on the 29 March 2011 12:05:29 and PASSED the requirements for a valid MOT with 1 comments.

This test (145868381413) was completed on the 29 March 2011 12:05:29 and PASSED the requirements for a valid MOT with 1 comments.

Recorded mileage: 84,627

Recorded mileage: 84,627


USER ENTERED


MOT TEST: 28 March 2011 15:31:49 FAILED
MOT TEST: 28 March 2011 15:31:49 FAILED

This test (799927181074) was completed on the 28 March 2011 15:31:49 and FAILED the requirements for a valid MOT with 2 comments.

This test (799927181074) was completed on the 28 March 2011 15:31:49 and FAILED the requirements for a valid MOT with 2 comments.

Recorded mileage: 84,627

Recorded mileage: 84,627


FAIL

USER ENTERED