775 EHO


775EHO is registered to a Blue 1962, Morris Minor traveller with a Petrol engine. It Failed its most recent MOT Test on the 06 March 2018

2 unique faults (2 Total) reported in its MOT History (8 Tests).

0 common/recurring faults.

88% (7) MOT Pass Rate and a 12% (1) MOT Failure Rate.

98,620 recorded miles.

775 EHO


775EHO is registered to a Blue 1962, Morris Minor traveller with a Petrol engine. It Failed its most recent MOT Test on the 06 March 2018

2 unique faults (2 Total) reported in its MOT History (8 Tests).

0 common/recurring faults.

88% (7) MOT Pass Rate and a 12% (1) MOT Failure Rate.

98,620 recorded miles.

MOT PASS/Failure rate for 775 EHO

all MOT test results for 775 EHO represented as a percentage
MOT PASS/Failure rate for 775 EHO
all MOT test results for 775 EHO represented as a percentage

PERCENTAGE OF VEHICLE FAULTS WITH 775 EHO

ALL REPORTED FAULTS, DISPLAYED BY PERCENTAGE OF OCCURRENCE DURING ALL MOT TESTS
PERCENTAGE OF VEHICLE FAULTS WITH 775 EHO
ALL REPORTED FAULTS, DISPLAYED BY PERCENTAGE OF OCCURRENCE DURING ALL MOT TESTS
FAIL

USER ENTERED

775 EHO annual Faults by type

ALL REPORTED FAULTS, DISPLAYED over time and categorised by type
775 EHO annual Faults by type
ALL REPORTED FAULTS, DISPLAYED over time and categorised by type

ALL 775 EHO Failure Faults [1]

ALL Failure faults, ORDERED by OCCURRENCE DURING 775 EHO's MOT HISTORY
ALL 775 EHO Failure Faults [1]
ALL Failure faults, ORDERED by OCCURRENCE DURING 775 EHO's MOT HISTORY
Fail Faults | source www.vehiclestats.co.uk
Fault Fault Test Date Test Date/Time Reference MOT Test Reference
1 Nearside headlamp not working on dipped beam (1.7.5a) Nearside headlamp not working on dipped beam (1.7.5a) 18 March 2013 [11:45] 18/03/2013 225587673036 225587673036

ALL 775 EHO User Entered Faults [1]

ALL User Entered faults, ORDERED by OCCURRENCE DURING 775 EHO's MOT HISTORY
ALL 775 EHO User Entered Faults [1]
ALL User Entered faults, ORDERED by OCCURRENCE DURING 775 EHO's MOT HISTORY
User Entered Faults | source www.vehiclestats.co.uk
Fault Fault Test Date Test Date/Time Reference MOT Test Reference
1 Coolant weep heater control valve area. Coolant weep heater control valve area. 04 March 2015 [14:51] 04/03/2015 658723665037 658723665037

MOT TEST: 06 March 2018 16:17:05 PASSED
MOT TEST: 06 March 2018 16:17:05 PASSED

This test (545084777713) was completed on the 06 March 2018 16:17:05 and PASSED the requirements for a valid MOT with 0 comments.

This test (545084777713) was completed on the 06 March 2018 16:17:05 and PASSED the requirements for a valid MOT with 0 comments.

Recorded mileage: 98,620

Recorded mileage: 98,620


MOT TEST: 14 March 2017 15:08:21 PASSED
MOT TEST: 14 March 2017 15:08:21 PASSED

This test (526477215326) was completed on the 14 March 2017 15:08:21 and PASSED the requirements for a valid MOT with 0 comments.

This test (526477215326) was completed on the 14 March 2017 15:08:21 and PASSED the requirements for a valid MOT with 0 comments.

Recorded mileage: 97,002

Recorded mileage: 97,002


MOT TEST: 18 March 2016 14:35:34 PASSED
MOT TEST: 18 March 2016 14:35:34 PASSED

This test (786307436826) was completed on the 18 March 2016 14:35:34 and PASSED the requirements for a valid MOT with 0 comments.

This test (786307436826) was completed on the 18 March 2016 14:35:34 and PASSED the requirements for a valid MOT with 0 comments.

Recorded mileage: 94,903

Recorded mileage: 94,903


MOT TEST: 04 March 2015 14:51:04 PASSED
MOT TEST: 04 March 2015 14:51:04 PASSED

This test (658723665037) was completed on the 04 March 2015 14:51:04 and PASSED the requirements for a valid MOT with 1 comments.

This test (658723665037) was completed on the 04 March 2015 14:51:04 and PASSED the requirements for a valid MOT with 1 comments.

Recorded mileage: 92,397

Recorded mileage: 92,397


USER ENTERED


MOT TEST: 20 March 2014 15:53:04 PASSED
MOT TEST: 20 March 2014 15:53:04 PASSED

This test (576709774075) was completed on the 20 March 2014 15:53:04 and PASSED the requirements for a valid MOT with 0 comments.

This test (576709774075) was completed on the 20 March 2014 15:53:04 and PASSED the requirements for a valid MOT with 0 comments.

Recorded mileage: 90,175

Recorded mileage: 90,175


MOT TEST: 18 March 2013 17:07:57 PASSED
MOT TEST: 18 March 2013 17:07:57 PASSED

This test (665697173031) was completed on the 18 March 2013 17:07:57 and PASSED the requirements for a valid MOT with 0 comments.

This test (665697173031) was completed on the 18 March 2013 17:07:57 and PASSED the requirements for a valid MOT with 0 comments.

Recorded mileage: 87,311

Recorded mileage: 87,311


MOT TEST: 18 March 2013 11:45:29 FAILED
MOT TEST: 18 March 2013 11:45:29 FAILED

This test (225587673036) was completed on the 18 March 2013 11:45:29 and FAILED the requirements for a valid MOT with 1 comments.

This test (225587673036) was completed on the 18 March 2013 11:45:29 and FAILED the requirements for a valid MOT with 1 comments.

Recorded mileage: 87,311

Recorded mileage: 87,311


FAIL


MOT TEST: 23 March 2012 15:50:58 PASSED
MOT TEST: 23 March 2012 15:50:58 PASSED

This test (716043782095) was completed on the 23 March 2012 15:50:58 and PASSED the requirements for a valid MOT with 0 comments.

This test (716043782095) was completed on the 23 March 2012 15:50:58 and PASSED the requirements for a valid MOT with 0 comments.

Recorded mileage: 84,440

Recorded mileage: 84,440